program: Orca
programVersion: 4.2.1
elementType: Cl Cl F F F F O N N N C C C C C C C C C C C C C H H H H H H H H H H H
charge: 0
multiplicity: 1
keywords: wb97x-d3
keywords: def2-TZVPP
keywords: def2/J RIJCOSX GRIDX6 NOFINALGRIDX
keywords: grid4 nofinalgrid
keywords: scfconv7
keywords: smallprint printgap noloewdin
keywords: NOSOSCF
formula: C13H11Cl2F4N3O
InChI: InChI=1S/C13H11Cl2F4N3O/c14-9-1-2-10(11(15)3-9)8(4-22-7-20-6-21-22)5-23-13(18,19)12(16)17/h1-3,6-8,12H,4-5H2
34 atoms
Cl -2.587982 0.626646 -2.554898
Cl -2.218618 5.134382 0.281157
F  2.874099 -2.138207 -0.479409
F  3.090498 -0.162851 -1.321457
F  3.056187 -1.108593 2.0575
F  3.302005 0.89501 1.222022
O  1.348708 -0.581799 0.009949
N  -0.816956 -2.901696 0.866411
N  -1.597011 -3.704305 0.138395
N  0.175809 -4.832678 0.919787
C  -0.99548 -0.747644 -0.306882
C  -1.126947 -1.504643 1.019766
C  0.365717 -0.960779 -0.955055
C  -1.310667 0.720823 -0.153592
C  -2.029823 1.422204 -1.121527
C  -0.859667 1.455524 0.940994
C  2.636892 -0.826491 -0.23263
C  -2.31523 2.773061 -0.999154
C  -1.12885 2.804318 1.090416
C  0.242111 -3.588895 1.319434
C  -1.864199 3.456019 0.115794
C  3.478261 -0.415754 0.976991
C  -0.965272 -4.852015 0.201223
H  -1.721182 -1.194553 -0.989702
H  -0.457105 -1.116515 1.784496
H  -2.145777 -1.406691 1.394931
H  0.486811 -2.007962 -1.241215
H  0.451938 -0.346809 -1.854506
H  -0.269673 0.972285 1.706996
H  -2.879906 3.28273 -1.766566
H  -0.764039 3.342344 1.953642
H  1.021036 -3.143431 1.919269
H  4.539674 -0.617759 0.812356
H  -1.34331 -5.736718 -0.286525
totalener: -2061.41776203 hartree
nucrepener: 2354.13566934 hartree
electener: -4415.55343137 hartree
oneelecener: -7519.86984182 hartree
twoeener: 3104.31641046 hartree
kineticenergy: 2055.85881337 hartree
xcener: -143.918361659237 hartree
chargesum: 0.0000000
charge: -0.065888 -0.063908 -0.185427 -0.185134 -0.188381 -0.177809 -0.280496 0.094179 -0.317627 -0.327073 0.131042 -0.166557 -0.074531 -0.014490 -0.026376 -0.139733 0.427155 -0.129837 -0.149535 0.049488 0.090569 0.279864 0.065047 0.114042 0.113023 0.129043 0.137394 0.131953 0.114259 0.116123 0.125249 0.139012 0.100693 0.134668
qa: -0.0659 -0.0639 -0.1854 -0.1851 -0.1884 -0.1778 -0.2805 0.0942 -0.3176 -0.3271 0.1310 -0.1666 -0.0745 -0.0145 -0.0264 -0.1397 0.4272 -0.1298 -0.1495 0.0495 0.0906 0.2799 0.0650 0.1140 0.1130 0.1290 0.1374 0.1320 0.1143 0.1161 0.1252 0.1390 0.1007 0.1347
va: 1.2604 1.2408 1.1128 1.1221 1.1004 1.1175 2.0859 3.3032 2.8498 3.0635 3.6243 3.9656 3.8950 3.5572 4.0446 3.9988 4.3566 4.0526 4.0796 4.0616 3.9311 4.1587 4.0426 1.0502 1.0017 1.0073 0.9929 1.0094 1.0218 1.0223 1.0131 1.0162 0.9898 1.0007
dispcorr: -0.019006028 hartree
energy: -2061.436768055838
dipole: -7.63954 7.86837 0.22883 -12.69606 13.40226 0.70620 4.90466 -4.66810 0.23656
magnitude: 0.77913 au
magnitude: 1.98039 debye
