program: Orca
programVersion: 4.2.1
elementType: Cl O N N N C C C C C C C C C C C C C C C C H H H H H H H H H H H H H H H H H H H H H H
charge: 0
multiplicity: 1
keywords: wb97x-d3
keywords: def2-TZVPP
keywords: def2/J RIJCOSX GRIDX6 NOFINALGRIDX
keywords: grid4 nofinalgrid
keywords: scfconv7
keywords: smallprint printgap noloewdin
keywords: NOSOSCF
formula: C16H22ClN3O
InChI: InChI=1S/C16H22ClN3O/c1-15(2,3)16(21,10-20-12-18-11-19-20)9-8-13-4-6-14(17)7-5-13/h4-7,11-12,21H,8-10H2,1-3H3
43 atoms
Cl 4.81763 4.483031 -1.174647
O  -1.276016 -0.782163 1.848832
N  -1.841241 -3.160516 0.145271
N  -2.046147 -3.512979 1.417741
N  -3.240954 -4.820749 0.048682
C  -1.371104 -0.695097 0.438731
C  -2.802187 -0.184363 0.020079
C  -0.291462 0.315077 0.004367
C  -0.981319 -2.047682 -0.192795
C  -3.933971 -0.966068 0.704167
C  -2.977214 1.281876 0.441674
C  -3.014291 -0.274883 -1.493739
C  1.158857 -0.055703 0.33723
C  2.088754 1.067313 -0.027386
C  -2.558089 -3.944731 -0.654598
C  2.180864 2.208188 0.76739
C  2.856815 1.011297 -1.186256
C  -2.893099 -4.50695 1.30769
C  3.013781 3.261594 0.423593
C  3.698606 2.053661 -1.547933
C  3.76829 3.173341 -0.7363
H  -0.503137 1.269105 0.49112
H  -0.371033 0.497276 -1.070547
H  -0.953901 -1.976203 -1.278159
H  0.02214 -2.31892 0.132367
H  -4.884606 -0.482772 0.473157
H  -3.84527 -0.972542 1.789902
H  -4.032466 -1.993553 0.361042
H  -4.01794 1.579935 0.305704
H  -2.374819 1.969509 -0.152033
H  -2.731372 1.437192 1.493179
H  -2.2357 0.237497 -2.060402
H  -3.064647 -1.30414 -1.852368
H  -3.963366 0.193497 -1.76149
H  1.475015 -0.950319 -0.201639
H  1.249914 -0.27721 1.402613
H  -1.678391 -1.61327 2.138366
H  -2.547886 -3.856168 -1.729228
H  1.596842 2.280334 1.677123
H  2.80514 0.135912 -1.822159
H  -3.269821 -5.026772 2.174368
H  3.074828 4.137058 1.055579
H  4.291072 1.986915 -2.450274
elementType: Cl O N C H
totalener: -1322.73054423 hartree
nucrepener: 1802.34337244 hartree
electener: -3125.07391666 hartree
oneelecener: -5386.01649700 hartree
twoeener: 2260.94258034 hartree
cpcmener: -0.03033152 hartree
kineticenergy: 1318.19362789 hartree
xcener: -106.467535277901 hartree
chargesum: 0.0000000
charge: -0.107891 -0.481053 0.138675 -0.379734 -0.410966 0.506274 0.222928 -0.302238 -0.278703 -0.374453 -0.365727 -0.371835 -0.009762 -0.020558 0.054637 -0.231770 -0.195320 0.079010 -0.154545 -0.154885 0.093516 0.107456 0.111857 0.135022 0.164129 0.101865 0.100523 0.097310 0.098257 0.096399 0.101246 0.108833 0.095372 0.103164 0.074130 0.104888 0.228714 0.176010 0.144683 0.141593 0.163719 0.144911 0.144321
qa: -0.1079 -0.4811 0.1387 -0.3797 -0.4110 0.5063 0.2229 -0.3022 -0.2787 -0.3745 -0.3657 -0.3718 -0.0098 -0.0206 0.0546 -0.2318 -0.1953 0.0790 -0.1545 -0.1549 0.0935 0.1075 0.1119 0.1350 0.1641 0.1019 0.1005 0.0973 0.0983 0.0964 0.1012 0.1088 0.0954 0.1032 0.0741 0.1049 0.2287 0.1760 0.1447 0.1416 0.1637 0.1449 0.1443
va: 1.1978 1.9550 3.3163 2.8446 3.0185 3.5534 3.7265 3.8822 3.9765 3.9274 3.9146 3.9559 3.7140 3.6140 4.0497 3.9844 3.9622 4.0149 3.9816 3.9805 3.8096 1.0060 1.0105 0.9855 0.9848 1.0106 1.0157 0.9990 1.0087 0.9951 1.0196 1.0036 1.0014 1.0037 1.0267 1.0249 1.0524 0.9937 1.0040 1.0037 0.9945 1.0050 1.0056
dispcorr: -0.023282170 hartree
energy: -1322.753826395085
dipole: -30.85796 30.56453 -0.29343 -10.87257 10.55973 -0.31284 1.23112 -2.46818 -1.23706
magnitude: 1.30930 au
magnitude: 3.32799 debye
