program: Orca
programVersion: 4.2.1
elementType: Cl O N N N C C C C C C C C C C C C C C C C H H H H H H H H H H H H H H H H H H H H H H
charge: 0
multiplicity: 1
keywords: wb97x-d3
keywords: def2-TZVPP
keywords: def2/J RIJCOSX GRIDX6 NOFINALGRIDX
keywords: grid4 nofinalgrid
keywords: scfconv7
keywords: smallprint printgap noloewdin
keywords: NOSOSCF
formula: C16H22ClN3O
InChI: InChI=1S/C16H22ClN3O/c1-15(2,3)16(21,10-20-12-18-11-19-20)9-8-13-4-6-14(17)7-5-13/h4-7,11-12,21H,8-10H2,1-3H3
43 atoms
Cl 5.060027 2.910529 -1.003687
O  -2.515056 -0.618172 1.702085
N  -1.307984 -2.624856 -0.147281
N  -0.219787 -2.651444 -0.920848
N  0.040771 -4.021535 0.835943
C  -2.358346 -0.393855 0.312921
C  -3.578762 0.483602 -0.123061
C  -1.022729 0.325187 -0.000909
C  -2.43077 -1.752184 -0.417147
C  -3.683099 1.729234 0.765048
C  -3.434916 0.939948 -1.578657
C  -4.899519 -0.287258 0.008201
C  0.129431 0.082341 0.982101
C  1.373815 0.778235 0.507474
C  -1.135991 -3.442101 0.89252
C  1.680675 2.065711 0.937536
C  2.227187 0.168305 -0.408673
C  0.556519 -3.496745 -0.289901
C  2.808887 2.730364 0.478244
C  3.359949 0.814554 -0.879376
C  3.641308 2.094677 -0.428171
H  -1.180606 1.40447 -0.026846
H  -0.696833 0.054677 -1.007618
H  -3.324837 -2.292532 -0.111765
H  -2.476006 -1.622767 -1.495868
H  -3.893188 1.480475 1.804907
H  -4.502353 2.358526 0.411417
H  -2.782376 2.344913 0.745518
H  -3.356177 0.106553 -2.279351
H  -2.570117 1.586461 -1.733792
H  -4.317197 1.51291 -1.870469
H  -5.026779 -0.731101 0.996053
H  -5.736516 0.395107 -0.148376
H  -5.003301 -1.080416 -0.733322
H  0.350888 -0.979295 1.112648
H  -0.136964 0.472992 1.966485
H  -1.7259 -1.038318 2.058672
H  -1.89235 -3.609007 1.643664
H  1.033187 2.564087 1.648862
H  2.007463 -0.831488 -0.763394
H  1.533109 -3.755387 -0.668383
H  3.033369 3.728561 0.828859
H  4.013446 0.322188 -1.586624
elementType: Cl O N C H
totalener: -1322.72897274 hartree
nucrepener: 1844.08632049 hartree
electener: -3166.81529322 hartree
oneelecener: -5469.46283178 hartree
twoeener: 2302.64753855 hartree
cpcmener: -0.02884837 hartree
kineticenergy: 1318.18731479 hartree
xcener: -106.462005534095 hartree
chargesum: 0.0000000
charge: -0.107962 -0.431626 0.118347 -0.359246 -0.408555 0.445337 0.223978 -0.333761 -0.223999 -0.351064 -0.353952 -0.374091 -0.076515 0.043008 0.034634 -0.231088 -0.236383 0.059717 -0.143782 -0.159044 0.090112 0.116114 0.114433 0.144898 0.129286 0.096098 0.099266 0.097837 0.102470 0.099194 0.100317 0.104029 0.100451 0.098295 0.115696 0.100192 0.224030 0.183415 0.142822 0.152629 0.166062 0.145108 0.143293
qa: -0.1080 -0.4316 0.1183 -0.3592 -0.4086 0.4453 0.2240 -0.3338 -0.2240 -0.3511 -0.3540 -0.3741 -0.0765 0.0430 0.0346 -0.2311 -0.2364 0.0597 -0.1438 -0.1590 0.0901 0.1161 0.1144 0.1449 0.1293 0.0961 0.0993 0.0978 0.1025 0.0992 0.1003 0.1040 0.1005 0.0983 0.1157 0.1002 0.2240 0.1834 0.1428 0.1526 0.1661 0.1451 0.1433
va: 1.1972 2.0066 3.3629 2.8403 3.0305 3.6317 3.7152 3.8655 3.9490 3.9256 3.9336 3.9243 3.7001 3.5563 4.0564 4.0103 3.9734 4.0231 3.9680 4.0338 3.8075 1.0091 1.0167 0.9884 1.0147 1.0170 1.0037 1.0042 1.0047 1.0022 1.0043 1.0167 1.0049 0.9967 1.0021 1.0329 1.0241 0.9985 1.0043 1.0035 0.9955 1.0047 1.0072
dispcorr: -0.024226560 hartree
energy: -1322.753199295744
dipole: -41.22825 39.33309 -1.89516 -1.69702 1.88909 0.19208 2.22019 -2.20408 0.01611
magnitude: 1.90493 au
magnitude: 4.84196 debye
