program: Orca
programVersion: 4.2.1
elementType: Cl O N N N C C C C C C C C C C C C C C C C H H H H H H H H H H H H H H H H H H H H H H
charge: 0
multiplicity: 1
keywords: wb97x-d3
keywords: def2-TZVPP
keywords: def2/J RIJCOSX GRIDX6 NOFINALGRIDX
keywords: grid4 nofinalgrid
keywords: scfconv7
keywords: smallprint printgap noloewdin
keywords: NOSOSCF
formula: C16H22ClN3O
InChI: InChI=1S/C16H22ClN3O/c1-15(2,3)16(21,10-20-12-18-11-19-20)9-8-13-4-6-14(17)7-5-13/h4-7,11-12,21H,8-10H2,1-3H3
43 atoms
Cl 5.061131 2.924895 -1.269057
O  -2.158216 -0.830862 1.683551
N  -1.415367 -2.824121 -0.140368
N  -0.299938 -2.983964 -0.861337
N  -0.232137 -4.273087 0.972163
C  -2.228585 -0.520665 0.305786
C  -3.425759 0.452197 0.0345
C  -0.873173 0.110733 -0.100814
C  -2.420076 -1.839754 -0.478042
C  -4.738039 -0.09497 0.614605
C  -3.162008 1.805201 0.703543
C  -3.632294 0.670207 -1.467261
C  0.057006 0.506177 1.048732
C  1.317501 1.11433 0.502236
C  -1.353127 -3.591901 0.946373
C  2.3193 0.307141 -0.033627
C  1.500423 2.493322 0.474325
C  0.372437 -3.854741 -0.154319
C  3.470602 0.852395 -0.579823
C  2.646454 3.059972 -0.06588
C  3.623293 2.230511 -0.590632
H  -1.048668 0.990546 -0.720534
H  -0.323207 -0.574409 -0.747141
H  -3.393674 -2.285042 -0.271423
H  -2.358709 -1.675666 -1.551236
H  -4.733254 -0.142975 1.705842
H  -5.001649 -1.082323 0.232712
H  -5.558423 0.572311 0.346233
H  -2.308417 2.330801 0.273006
H  -2.989313 1.702892 1.775644
H  -4.030238 2.454727 0.574438
H  -2.724497 0.998477 -1.975927
H  -3.991043 -0.22815 -1.972483
H  -4.385481 1.444067 -1.62646
H  0.309471 -0.372131 1.645148
H  -0.430738 1.216626 1.718227
H  -3.009061 -1.181532 1.969742
H  -2.146089 -3.65021 1.673619
H  2.202935 -0.770888 -0.026193
H  0.738532 3.14495 0.88478
H  1.33801 -4.213749 -0.473792
H  4.237943 0.209371 -0.988551
H  2.771132 4.134184 -0.073612
elementType: Cl O N C H
totalener: -1322.72701705 hartree
nucrepener: 1833.35187802 hartree
electener: -3156.07889507 hartree
oneelecener: -5448.48694275 hartree
twoeener: 2292.40804768 hartree
cpcmener: -0.03329551 hartree
kineticenergy: 1318.20699985 hartree
xcener: -106.465027251154 hartree
chargesum: -0.0000000
charge: -0.108397 -0.434399 0.120998 -0.362946 -0.421601 0.446140 0.170306 -0.336643 -0.194068 -0.360650 -0.351830 -0.360313 -0.031437 0.029245 0.064632 -0.227373 -0.205312 0.059569 -0.163862 -0.159895 0.095972 0.116889 0.109418 0.150202 0.126330 0.094221 0.111896 0.100778 0.093713 0.099589 0.102204 0.107409 0.098465 0.099545 0.097866 0.101352 0.218589 0.167244 0.144997 0.140482 0.162888 0.143715 0.144072
qa: -0.1084 -0.4344 0.1210 -0.3629 -0.4216 0.4461 0.1703 -0.3366 -0.1941 -0.3606 -0.3518 -0.3603 -0.0314 0.0292 0.0646 -0.2274 -0.2053 0.0596 -0.1639 -0.1599 0.0960 0.1169 0.1094 0.1502 0.1263 0.0942 0.1119 0.1008 0.0937 0.0996 0.1022 0.1074 0.0985 0.0995 0.0979 0.1014 0.2186 0.1672 0.1450 0.1405 0.1629 0.1437 0.1441
va: 1.1968 1.9948 3.3549 2.8671 3.0293 3.5795 3.8569 3.8376 3.8984 3.9243 3.9131 3.9410 3.7022 3.5240 4.0781 3.9885 3.9840 4.0363 4.0123 3.9909 3.8043 1.0127 1.0303 0.9905 1.0107 1.0081 1.0043 1.0032 1.0016 1.0172 1.0098 1.0026 0.9984 1.0048 1.0226 1.0157 1.0200 1.0022 1.0041 1.0052 0.9955 1.0066 1.0053
dispcorr: -0.023741783 hartree
energy: -1322.750758830825
dipole: -41.52553 38.25259 -3.27293 -0.95040 1.47178 0.52138 4.08848 -4.07152 0.01696
magnitude: 3.31425 au
magnitude: 8.42414 debye
