program: Orca
programVersion: 4.2.1
elementType: Cl O N N N C C C C C C C C C C C C C C C C H H H H H H H H H H H H H H H H H H H H H H
charge: 0
multiplicity: 1
keywords: wb97x-d3
keywords: def2-TZVPP
keywords: def2/J RIJCOSX GRIDX6 NOFINALGRIDX
keywords: grid4 nofinalgrid
keywords: scfconv7
keywords: smallprint printgap noloewdin
keywords: NOSOSCF
formula: C16H22ClN3O
InChI: InChI=1S/C16H22ClN3O/c1-15(2,3)16(21,10-20-12-18-11-19-20)9-8-13-4-6-14(17)7-5-13/h4-7,11-12,21H,8-10H2,1-3H3
43 atoms
Cl 5.332496 2.411919 -0.123907
O  -2.474658 -0.720459 1.850406
N  -1.233688 -2.606456 0.08447
N  -0.083732 -2.687584 -0.594054
N  0.026184 -3.924992 1.271535
C  -2.331057 -0.404402 0.473503
C  -3.541105 0.476436 -0.003758
C  -0.96264 0.296673 0.440203
C  -2.295868 -1.721302 -0.332096
C  -4.864999 -0.095929 0.52879
C  -3.40791 1.902556 0.534952
C  -3.666055 0.53206 -1.531783
C  -0.408632 0.768884 -0.905248
C  1.026818 1.189762 -0.751301
C  -1.147128 -3.341428 1.192565
C  1.363838 2.517664 -0.508773
C  2.052051 0.247196 -0.795816
C  0.634049 -3.484161 0.155774
C  2.682886 2.904123 -0.315078
C  3.375879 0.612882 -0.607417
C  3.679531 1.943688 -0.365653
H  -0.236057 -0.390152 0.884345
H  -0.997934 1.151722 1.119748
H  -3.240705 -2.257147 -0.227103
H  -2.150991 -1.543364 -1.393995
H  -5.699413 0.453878 0.090746
H  -4.968434 0.005966 1.610782
H  -5.015029 -1.145874 0.267791
H  -2.580712 2.448122 0.078612
H  -3.267052 1.918642 1.616639
H  -4.317265 2.466246 0.31768
H  -2.753618 0.851834 -2.031365
H  -3.960205 -0.427002 -1.959725
H  -4.444708 1.246695 -1.80345
H  -0.988125 1.611457 -1.284791
H  -0.473295 -0.023419 -1.65249
H  -3.318981 -1.162507 1.99198
H  -1.956315 -3.448095 1.89568
H  0.587718 3.272531 -0.470188
H  1.814371 -0.79374 -0.978762
H  1.637856 -3.764873 -0.122419
H  2.924694 3.941508 -0.128327
H  4.158184 -0.132798 -0.64932
elementType: Cl O N C H
totalener: -1322.72905665 hartree
nucrepener: 1846.36837940 hartree
electener: -3169.09743605 hartree
oneelecener: -5474.43546029 hartree
twoeener: 2305.33802423 hartree
cpcmener: -0.03385464 hartree
kineticenergy: 1318.20081472 hartree
xcener: -106.465591050165 hartree
chargesum: -0.0000000
charge: -0.108285 -0.446496 0.126770 -0.374071 -0.419350 0.492076 0.146248 -0.320120 -0.241703 -0.374329 -0.349448 -0.361765 -0.050558 0.012587 0.071613 -0.206194 -0.227808 0.070774 -0.162897 -0.170849 0.105382 0.116195 0.116882 0.157478 0.124225 0.099472 0.096981 0.115175 0.099372 0.100173 0.099480 0.117336 0.101258 0.101780 0.093959 0.105616 0.228248 0.164684 0.141578 0.157844 0.164032 0.144400 0.142251
qa: -0.1083 -0.4465 0.1268 -0.3741 -0.4193 0.4921 0.1462 -0.3201 -0.2417 -0.3743 -0.3494 -0.3618 -0.0506 0.0126 0.0716 -0.2062 -0.2278 0.0708 -0.1629 -0.1708 0.1054 0.1162 0.1169 0.1575 0.1242 0.0995 0.0970 0.1152 0.0994 0.1002 0.0995 0.1173 0.1013 0.1018 0.0940 0.1056 0.2282 0.1647 0.1416 0.1578 0.1640 0.1444 0.1423
va: 1.1968 2.0053 3.3181 2.8261 3.0384 3.6495 3.7884 3.9152 3.9434 3.9358 3.9093 3.9346 3.6693 3.5326 4.0786 3.9926 3.9645 4.0169 3.9907 4.0287 3.7968 1.0119 1.0125 0.9911 1.0019 1.0041 1.0074 1.0034 0.9995 1.0173 1.0077 0.9976 0.9962 1.0053 1.0144 1.0205 1.0118 1.0072 1.0036 1.0090 0.9943 1.0055 1.0078
dispcorr: -0.024449498 hartree
energy: -1322.753506150901
dipole: -43.89542 40.53825 -3.35717 0.63155 -0.17447 0.45708 -2.42443 1.66367 -0.76076
magnitude: 3.47250 au
magnitude: 8.82639 debye
