program: Gaussian 09
title: 000030739
version: EM64L-G09RevD.01
frameworkgroup: C1[X(C10H25ClNSi)]
method: RPBEPBE
basis: SDD
operation: Freq
keyword: #p
keyword: freq=noraman
keyword: PBEPBE/SDD
title: #p freq=noraman PBEPBE/SDD
converged: NO YES NO NO
title: Mulliken charges:
elementType: Cl Si N C C C C C C C C C C H H H H H H H H H H H H H H H H H H H H H H H H H
charge: 0.042557 1.241100 -0.102997 -0.767525 -0.723532 -0.741638 -0.290444 -1.018761 -0.554716 -0.565102 -0.664437 -0.657583 -0.640382 0.275079 0.273221 0.240389 0.236339 0.231239 0.266626 0.310691 0.283794 0.245696 0.280836 0.232485 0.267825 0.270511 0.268482 0.269432 0.267450 0.272295 0.249469 0.225137 0.221181 0.255084 0.237509 0.181857 0.284966 0.295866
chargesum: 1.00000
title: Mulliken charges with hydrogens summed into heavy atoms:
elementType: Cl Si N C C C C C C C C C C
charge: 0.042557 1.241100 -0.102997 -0.219225 -0.246804 -0.243774 0.304040 -0.259744 0.252103 0.244076 0.031351 0.016867 -0.059549
polarizability: 1.63333618e+02 -3.40619354e+00 1.47644562e+02 -3.99376567e+00 2.92445794e+00 1.25237032e+02
1716.lowfreq: -22.2066 -13.6561 -4.4832 -0.0028 -0.0025 -0.0024 11.6386 30.4756 51.1790
frequency: -17.7351 29.4978 51.0430 60.6898 65.8426 88.5865 121.6105 142.4979 157.2164 166.8663 167.0796 178.7140 185.4616 200.2033 218.1389 229.5477 234.0823 260.1638 271.3847 276.3091 325.3408 341.8428 361.1450 405.3417 466.0795 475.6264 567.6357 629.1857 661.1369 676.0706 700.5551 709.2399 745.3070 759.0091 777.5833 784.3186 839.2851 850.5889 889.7060 905.1330 959.7298 974.0026 986.5304 991.1902 996.6998 1019.9442 1028.9129 1030.7950 1062.7925 1097.7898 1119.5601 1152.9137 1177.8036 1230.9719 1234.7961 1238.0054 1249.1220 1250.1135 1271.9475 1287.3015 1302.4221 1312.2760 1319.6424 1376.7030 1397.4872 1402.9384 1419.4839 1434.7987 1437.5489 1439.2053 1443.4464 1449.2601 1456.0334 1461.8039 1467.0714 1470.4329 1472.6327 1478.0574 1479.4918 1481.2954 1488.2962 1488.7472 1491.6855 2972.4426 2978.0951 2979.4954 2981.7249 2984.0283 3004.0431 3022.1610 3024.5774 3028.4741 3031.2740 3042.6107 3061.5047 3068.6738 3073.9377 3076.2755 3078.4144 3082.1060 3082.6761 3085.0304 3122.5446 3136.9326 3140.8297 3148.0515 3151.1978 3156.0852
redmass: 3.7881 5.0785 2.6150 2.4763 2.1699 3.1666 2.4651 2.2582 1.4591 1.4383 1.8728 2.0978 2.2350 2.2439 1.1361 1.7208 1.4667 2.3076 2.8556 1.2764 2.8853 2.0309 2.9291 3.2784 2.4726 2.4854 3.4594 3.5063 2.3713 1.5509 2.5025 3.1978 1.8134 3.2023 1.8716 1.1981 1.3857 1.6290 2.7169 2.7343 2.0019 1.4266 1.5182 1.2544 1.6158 2.2995 1.4903 2.2430 2.4375 1.3992 1.4454 1.3769 1.3495 1.2741 1.5598 1.2476 1.4161 1.3391 1.1605 1.3773 1.3859 1.1917 1.1709 1.2648 1.1802 1.1777 1.1439 1.0988 1.0698 1.0906 1.0783 1.0615 1.0755 1.0551 1.0691 1.0822 1.0617 1.0460 1.0525 1.0485 1.0427 1.0433 1.0611 1.0387 1.0584 1.0370 1.0573 1.0372 1.0593 1.0326 1.0381 1.0913 1.0994 1.0628 1.0969 1.0630 1.0965 1.0944 1.1001 1.1000 1.1000 1.0992 1.1040 1.1055 1.1053 1.1052 1.1052 1.1106
irintensity: 1.1147 1.6869 0.9976 0.5885 1.1202 0.1547 0.6205 1.2317 0.4541 0.6544 0.1974 2.0839 2.4312 0.4153 0.0327 0.5759 0.1968 0.8730 1.2600 0.9396 1.0198 0.9072 5.4036 6.0311 1.7090 3.2309 1.7775 1.7297 3.3051 7.5241 12.3223 33.5828 22.7541 8.2182 40.2954 28.6029 56.3773 105.7404 4.0886 8.9112 9.9798 10.2554 3.5812 4.2823 1.5400 40.4917 0.8550 22.8391 0.9954 3.0070 0.7118 5.8173 1.6743 1.1785 3.4410 0.7436 3.0208 3.0761 4.1595 5.2825 5.6716 26.8938 3.6251 0.9796 10.6461 7.1293 14.7421 2.1736 6.3232 6.5378 6.9885 16.5993 4.5937 32.2946 9.3451 28.4628 3.5897 15.3368 20.3607 6.4571 25.0051 32.1307 62.3413 27.1421 16.0326 5.2871 16.8287 24.6898 6.2903 3.8849 1.0417 6.7089 6.7338 4.9921 56.0319 9.7600 17.2320 5.0896 37.6542 38.7157 0.4063 14.6364 2.3641 1.1959 6.4207 3.4641 5.8886 4.9060
temp: 298.150 k
press: 1.00000 atm
elementType: 17 14 7 6 6 6 6 6 6 6 6 6 6 1 1 1 1 1 1 1 1 1 1 1 1 1 1 1 1 1 1 1 1 1 1 1 1 1
symmnumber: 1
zpe: 884159.6 jmol-1
zpe.correction: 0.336759 hartree
zpe.thermalcorrener: 0.355523 hartree
zpe.thermalcorrenthalpy: 0.356467 hartree
zpe.thermalcorrgfe: 0.289917 hartree
zpe.sumelectzpe: -1198.915130 hartree
zpe.sumelectthermal: -1198.896366 hartree
zpe.sumelectthermalent: -1198.895422 hartree
zpe.sumelectthermalfe: -1198.961972 hartree
dipole: 1.1082 5.6446 1.1910
dipole: 5.8744
quadrupole: -80.5120 -78.4078 -87.9186
quadrupole: 11.5921 3.9218 0.3456
quadrupole: 1.7674 3.8717 -5.6391 11.5921 3.9218 0.3456
hfenergy: -1199.251889 hartree
pointgroup: C01 [X(C10H25Cl1N1Si1)]
dipole: -0.8052638 -2.0964803 0.5456651 debye
polarizability: 161.8189049|-5.8716672|149.0609031|2.8682862|-4.1490843|125.3354045 unknown
InChI: InChI=1S/C10H25ClNSi/c1-6-13(5,7-2)10-12(3,4)9-8-11/h6-10H2,1-5H3
charge 1 multiplicity 1
38 atoms
Cl -3.795836 2.348956 -0.289774
Si 1.324847 0.363446 -0.234985
N  -1.397314 -1.046684 0.241214
C  -0.093301 -0.48116 0.852138
C  2.363586 1.206931 1.142928
C  2.344614 -0.985404 -1.147593
C  -2.293405 0.075349 -0.339788
C  0.647642 1.663738 -1.465308
C  -1.065416 -2.004258 -0.902126
C  -2.163359 -1.827322 1.312823
C  3.712119 1.775875 0.624997
C  2.910749 -2.103061 -0.234095
C  -2.826576 1.08035 0.689725
H  0.38138 -1.333575 1.376165
H  -0.399944 0.236691 1.634306
H  1.762346 2.024738 1.588875
H  2.556419 0.483929 1.960879
H  1.756977 -1.425603 -1.977242
H  3.186288 -0.45833 -1.6414
H  -1.689443 0.600452 -1.094591
H  -3.136836 -0.425125 -0.846753
H  -0.052605 2.378005 -0.994698
H  1.501044 2.258047 -1.843134
H  0.160661 1.22088 -2.353515
H  -1.986664 -2.514786 -1.223886
H  -0.64321 -1.433613 -1.74153
H  -0.328367 -2.740709 -0.548254
H  -3.147827 -2.123184 0.916662
H  -1.58216 -2.723726 1.577492
H  -2.286625 -1.198928 2.206377
H  4.264694 2.272306 1.441914
H  4.365584 0.980278 0.222785
H  3.563452 2.526906 -0.172493
H  3.530023 -2.810302 -0.81346
H  3.55018 -1.687716 0.56598
H  2.112914 -2.697267 0.254128
H  -2.038214 1.642662 1.209227
H  -3.538318 0.648916 1.40691
