program: Gaussian 09
title: 000030768
version: EM64L-G09RevD.01
frameworkgroup: C1[X(C17H17ClN2O)]
method: RPBEPBE
basis: SDD
operation: Freq
keyword: #p
keyword: freq=noraman
keyword: PBEPBE/SDD
title: #p freq=noraman PBEPBE/SDD
converged: YES YES NO NO
title: Mulliken charges:
elementType: Cl O N N C C C C C C C C C C C C C C C C C H H H H H H H H H H H H H H H H H
charge: -0.076575 -0.299111 -0.114976 -0.358981 0.049914 0.346208 0.418922 -0.746113 0.004657 -0.329678 0.170090 -0.352562 -0.420385 -0.343033 -0.133583 -0.227151 -0.236409 -0.240999 -0.364285 -0.237520 -0.649564 0.229512 0.238293 0.252792 0.275450 0.252230 0.242550 0.255231 0.253419 0.319793 0.227862 0.227100 0.262071 0.213198 0.230147 0.205596 0.238245 0.217645
chargesum: 0.00000
title: Mulliken charges with hydrogens summed into heavy atoms:
elementType: Cl O N N C C C C C C C C C C C C C C C C C
charge: -0.076575 -0.299111 -0.114976 -0.039188 0.049914 0.346208 0.418922 -0.025516 0.004657 -0.054229 0.170090 -0.100332 -0.177835 -0.087802 -0.133583 0.026268 -0.008546 -0.013899 0.110984 -0.007374 0.011921
polarizability: 2.74601245e+02 -1.69815794e+00 2.24491495e+02 9.45870475e-01 -4.66123230e+00 1.48981876e+02
1716.lowfreq: -8.6869 -5.2497 -0.0008 0.0011 0.0017 4.0358 5.0648 25.2838 41.6447
frequency: 1.3886 25.2030 41.6078 46.2931 54.3582 107.2283 118.1301 130.3598 171.5352 182.4210 197.8302 241.1420 251.5426 268.8984 279.4587 299.2137 318.0993 346.7301 369.6939 385.7338 400.6471 420.5219 442.2427 471.1153 484.5607 507.5723 519.5861 556.9705 588.0377 599.0893 613.8790 619.0037 666.4651 677.7503 702.2342 738.5789 751.1554 766.3073 786.5095 796.0978 832.3972 838.9376 852.9021 878.0585 890.9753 896.4124 929.6505 939.7880 953.2401 978.2606 991.3743 997.8478 1022.6914 1030.5511 1057.1925 1070.7408 1074.9289 1082.7779 1094.0144 1112.1288 1122.8181 1138.7455 1174.2944 1190.9020 1193.9877 1210.0001 1251.0871 1263.8963 1292.6263 1305.8359 1320.5452 1355.3221 1362.6563 1381.6504 1384.3883 1386.5089 1404.9262 1435.1392 1457.6718 1463.4865 1467.9733 1470.1308 1476.5292 1480.7466 1485.3001 1500.5263 1562.9194 1592.5824 1593.9216 1614.3256 1637.4613 2982.6777 2991.9599 3006.6724 3071.2222 3087.2149 3091.2528 3098.0318 3101.0284 3126.2554 3135.6763 3149.4788 3154.6623 3157.0608 3157.6266 3168.6328 3175.8741 3571.2726
redmass: 2.5195 3.8051 3.9471 7.2922 5.7974 4.6214 3.4451 3.7028 6.3611 4.1830 2.7182 1.6881 3.2698 3.4851 2.4709 1.3101 6.9966 4.0777 4.6212 4.8651 2.8042 3.0016 4.5932 3.8526 4.2533 1.3699 3.2248 3.7699 4.6121 3.9113 5.9549 6.1235 9.2625 5.1889 1.6843 5.2799 3.5224 1.9108 3.3056 1.6806 1.5695 3.1377 1.2638 2.8770 1.4713 2.3225 1.4647 3.7665 1.3504 1.3908 6.1556 1.3192 2.8342 2.6012 2.3295 2.2524 2.5814 1.9924 1.7284 2.0634 1.8423 1.7673 1.0528 2.6851 1.1835 2.6895 1.4366 3.7239 1.2544 2.2297 1.3275 1.3260 5.9073 8.4939 1.2439 1.2172 3.8515 2.1761 2.2860 1.0726 1.1257 1.0732 1.1056 1.0637 2.2444 1.8546 8.1255 6.6953 7.0414 6.0720 9.1082 1.0356 1.0351 1.0655 1.0994 1.0974 1.0994 1.1013 1.1021 1.0847 1.0882 1.0924 1.0883 1.0922 1.0954 1.1010 1.0973 1.0768
irintensity: 0.1075 0.1766 0.6846 0.3670 0.3054 0.3326 0.9708 1.4176 2.4076 0.4987 0.8064 0.5851 0.3505 1.5783 0.5624 0.2526 2.1969 0.4488 0.6087 5.1188 0.3067 1.9097 1.5999 4.0044 5.7590 124.6916 6.1575 35.7383 1.0514 5.0885 1.3057 2.5813 19.0836 2.0224 47.6409 14.9469 0.9564 49.6545 1.5163 6.7457 48.7530 26.9841 0.4517 26.1034 12.1611 12.0298 3.0860 72.2701 0.7320 0.0620 1.2134 0.0536 11.2667 52.1602 1.0082 8.9458 28.1485 13.5197 18.4912 6.7192 4.9290 4.0977 0.4501 88.6006 4.1366 109.2112 15.8272 60.2054 53.7276 15.5112 0.8309 9.6711 7.4682 0.8982 23.4416 21.0747 43.3769 13.0048 205.1777 40.1375 16.4307 4.1117 34.7580 10.1278 6.9683 94.4606 2.1690 133.8271 161.7554 8.2032 700.2021 32.5231 9.8709 61.2660 15.9009 39.9414 16.1869 17.7786 30.7070 0.5433 4.8678 26.3317 4.2887 1.2334 29.1499 13.5754 7.3116 78.4927
temp: 298.150 k
press: 1.00000 atm
elementType: 17 8 7 7 6 6 6 6 6 6 6 6 6 6 6 6 6 6 6 6 6 1 1 1 1 1 1 1 1 1 1 1 1 1 1 1 1 1
symmnumber: 1
zpe: 787594.8 jmol-1
zpe.correction: 0.299979 hartree
zpe.thermalcorrener: 0.319297 hartree
zpe.thermalcorrenthalpy: 0.320241 hartree
zpe.thermalcorrgfe: 0.247895 hartree
zpe.sumelectzpe: -1301.302267 hartree
zpe.sumelectthermal: -1301.282950 hartree
zpe.sumelectthermalent: -1301.282006 hartree
zpe.sumelectthermalfe: -1301.354351 hartree
dipole: 2.9011 -3.1322 0.5312
dipole: 4.3023
quadrupole: -118.6334 -127.6390 -125.4282
quadrupole: 6.8009 -2.6491 -1.2375
quadrupole: 5.2668 -3.7388 -1.5280 6.8009 -2.6491 -1.2375
hfenergy: -1301.6022464 hartree
pointgroup: C01 [X(C17H17Cl1N2O1)]
dipole: 0.9111844 -1.3535599 0.4502018 debye
polarizability: 272.2228175|-8.1804562|223.6030633|9.123437|-15.2528977|152.248735 unknown
InChI: InChI=1S/C17H17ClN2O/c1-3-19-16-20-15-10-9-13(18)11-14(15)17(2,21-16)12-7-5-4-6-8-12/h4-11,19H,3H2,1-2H3
charge 0 multiplicity 1
38 atoms
Cl -3.039147 3.624036 -1.039773
O  1.117373 -1.194691 0.411385
N  2.239721 0.959074 0.278111
N  3.395105 -1.086478 0.595988
C  -0.192525 -0.52584 0.823163
C  -0.244512 0.865267 0.172196
C  -1.273152 -1.47423 0.29772
C  -0.152981 -0.385446 2.359762
C  0.99143 1.564031 -0.000665
C  -1.466694 1.488902 -0.15291
C  2.24862 -0.348846 0.436246
C  -1.207029 -1.907241 -1.052127
C  -2.354435 -1.907348 1.101301
C  0.967806 2.898084 -0.48374
C  -1.451486 2.812647 -0.630579
C  -0.251453 3.532799 -0.796241
C  -2.194285 -2.762792 -1.582242
C  -3.34985 -2.76014 0.569423
C  4.741584 -0.524801 0.398881
C  -3.27326 -3.191784 -0.772684
C  5.313978 -0.809319 -1.0071
H  -1.066312 0.112442 2.729063
H  -0.057096 -1.37428 2.840564
H  0.706784 0.239969 2.656089
H  -2.413367 0.952914 -0.035262
H  -0.370907 -1.57757 -1.677103
H  -2.431159 -1.588538 2.145648
H  1.921009 3.41954 -0.61205
H  -0.268556 4.5621 -1.166028
H  3.27123 -2.091852 0.721028
H  -2.126899 -3.091995 -2.625115
H  -4.181854 -3.085238 1.203999
H  4.657347 0.56191 0.562401
H  5.410061 -0.937777 1.177761
H  -4.043976 -3.85279 -1.184636
H  5.397015 -1.894956 -1.199225
H  4.665626 -0.366819 -1.783177
H  6.322546 -0.367041 -1.105275
