program: Orca
programVersion: 4.2.1
elementType: Cl O N N N C C C C C C C C C C C C C C C C H H H H H H H H H H H H H H H H H H H H H H
charge: 0
multiplicity: 1
keywords: wb97x-d3
keywords: def2-TZVPP
keywords: def2/J RIJCOSX GRIDX6 NOFINALGRIDX
keywords: grid4 nofinalgrid
keywords: scfconv7
keywords: smallprint printgap noloewdin
keywords: NOSOSCF
formula: C16H22ClN3O
InChI: InChI=1S/C16H22ClN3O/c1-15(2,3)16(21,10-20-12-18-11-19-20)9-8-13-4-6-14(17)7-5-13/h4-7,11-12,21H,8-10H2,1-3H3
43 atoms
Cl 5.306315 2.570425 -0.169977
O  -2.543608 -0.634071 1.874259
N  -1.208534 -2.564675 0.258536
N  -0.198672 -2.865908 -0.563203
N  0.073401 -3.892792 1.404058
C  -2.336244 -0.345409 0.498709
C  -3.559682 0.4895 -0.024667
C  -0.964641 0.354647 0.379313
C  -2.312604 -1.728373 -0.169244
C  -4.850143 -0.338351 0.06025
C  -3.756375 1.7340 0.849309
C  -3.401877 0.957551 -1.474535
C  -0.27696 0.463358 -0.988044
C  1.122172 0.987983 -0.819106
C  -1.033794 -3.187487 1.426948
C  1.393511 2.350211 -0.908547
C  2.175574 0.126271 -0.522952
C  0.545576 -3.659486 0.165221
C  2.674167 2.846452 -0.711472
C  3.462281 0.601382 -0.321694
C  3.700201 1.963589 -0.417104
H  -0.284478 -0.187973 1.043078
H  -1.038777 1.358152 0.810075
H  -3.232127 -2.265286 0.058776
H  -2.247466 -1.650964 -1.251826
H  -5.712162 0.309009 -0.11381
H  -4.985401 -0.799577 1.039209
H  -4.898037 -1.124863 -0.69522
H  -4.560083 2.347203 0.436858
H  -2.870003 2.369694 0.891849
H  -4.046393 1.487422 1.871965
H  -4.360595 1.331175 -1.840701
H  -2.694639 1.780474 -1.574352
H  -3.09341 0.162527 -2.155986
H  -0.822608 1.125881 -1.655995
H  -0.236324 -0.511801 -1.474193
H  -2.301169 0.135853 2.399389
H  -1.727221 -3.111373 2.247842
H  0.594231 3.044494 -1.140205
H  1.992704 -0.939455 -0.453487
H  1.458195 -4.091399 -0.21583
H  2.864771 3.908449 -0.789388
H  4.267336 -0.085161 -0.096319
elementType: Cl O N C H
totalener: -1322.73691818 hartree
nucrepener: 1840.43183764 hartree
electener: -3163.16875583 hartree
oneelecener: -5462.34901538 hartree
twoeener: 2299.18025955 hartree
cpcmener: -0.02513205 hartree
kineticenergy: 1318.16981234 hartree
xcener: -106.458278814035 hartree
chargesum: 0.0000000
charge: -0.105495 -0.417923 0.134792 -0.379856 -0.413292 0.461612 0.218178 -0.377234 -0.203960 -0.370714 -0.381561 -0.385891 -0.076659 0.029480 0.066179 -0.216737 -0.211545 0.069705 -0.144444 -0.161524 0.092909 0.123590 0.123703 0.150596 0.131407 0.097158 0.102239 0.098930 0.099977 0.106361 0.098968 0.104448 0.101802 0.105602 0.106831 0.107675 0.212528 0.164014 0.139669 0.152614 0.164584 0.141575 0.139708
qa: -0.1055 -0.4179 0.1348 -0.3799 -0.4133 0.4616 0.2182 -0.3772 -0.2040 -0.3707 -0.3816 -0.3859 -0.0767 0.0295 0.0662 -0.2167 -0.2115 0.0697 -0.1444 -0.1615 0.0929 0.1236 0.1237 0.1506 0.1314 0.0972 0.1022 0.0989 0.1000 0.1064 0.0990 0.1044 0.1018 0.1056 0.1068 0.1077 0.2125 0.1640 0.1397 0.1526 0.1646 0.1416 0.1397
va: 1.1998 2.0188 3.3119 2.8337 3.0340 3.6800 3.6978 3.9936 3.8333 3.9122 3.9332 3.9578 3.6507 3.5794 4.0705 4.0010 3.9663 4.0114 3.9782 4.0334 3.8173 1.0106 1.0060 0.9921 1.0094 1.0049 1.0224 0.9948 1.0025 0.9999 1.0112 1.0069 0.9983 1.0016 1.0189 1.0322 1.0222 1.0123 1.0047 1.0056 0.9936 1.0058 1.0084
dispcorr: -0.024224918 hartree
energy: -1322.761143100829
dipole: -42.84365 40.51442 -2.32922 0.89504 0.40655 1.30159 -2.28950 1.95216 -0.33734
magnitude: 2.68946 au
magnitude: 6.83607 debye
