program: Orca
programVersion: 4.2.1
elementType: Cl O N N N C C C C C C C C C C C C C C C C H H H H H H H H H H H H H H H H H H H H H H
charge: 0
multiplicity: 1
keywords: wb97x-d3
keywords: def2-TZVPP
keywords: def2/J RIJCOSX GRIDX6 NOFINALGRIDX
keywords: grid4 nofinalgrid
keywords: scfconv7
keywords: smallprint printgap noloewdin
keywords: NOSOSCF
formula: C16H22ClN3O
InChI: InChI=1S/C16H22ClN3O/c1-15(2,3)16(21,10-20-12-18-11-19-20)9-8-13-4-6-14(17)7-5-13/h4-7,11-12,21H,8-10H2,1-3H3
43 atoms
Cl 5.059711 2.660731 -1.516979
O  -2.418353 -0.466378 1.857195
N  -1.269344 -2.571767 0.116725
N  -1.001918 -2.965193 1.36586
N  0.61379 -3.642403 -0.020854
C  -2.35788 -0.359681 0.449987
C  -3.613244 0.471468 0.026305
C  -1.045345 0.332133 -0.014256
C  -2.439057 -1.76963 -0.171606
C  -4.911803 -0.270675 0.366613
C  -3.633585 1.806804 0.781008
C  -3.608626 0.763774 -1.47714
C  0.125737 0.264867 0.9722
C  1.367234 0.860549 0.371705
C  -0.297451 -2.979144 -0.698278
C  2.313946 0.057025 -0.258268
C  1.588786 2.235438 0.400164
C  0.137252 -3.602455 1.236155
C  3.449724 0.59912 -0.841742
C  2.71714 2.797925 -0.177454
C  3.640889 1.970446 -0.796184
H  -1.228623 1.389133 -0.215729
H  -0.730612 -0.080902 -0.977644
H  -3.305383 -2.313433 0.203687
H  -2.52296 -1.714919 -1.255173
H  -5.063726 -1.163414 -0.243548
H  -5.768748 0.380602 0.17763
H  -4.954517 -0.566975 1.415515
H  -4.506745 2.387365 0.473903
H  -2.758572 2.426664 0.57608
H  -3.699792 1.672296 1.860509
H  -3.672361 -0.140527 -2.085862
H  -4.477135 1.373526 -1.735148
H  -2.726724 1.318649 -1.800426
H  0.342921 -0.759298 1.27881
H  -0.136282 0.807842 1.882045
H  -1.884298 -1.218502 2.148772
H  -0.297665 -2.782336 -1.759216
H  2.174049 -1.017733 -0.289836
H  0.873114 2.886444 0.888801
H  0.636758 -4.054315 2.079132
H  4.175949 -0.044594 -1.319792
H  2.873312 3.867754 -0.138422
elementType: Cl O N C H
totalener: -1322.74030360 hartree
nucrepener: 1846.91108881 hartree
electener: -3169.65139241 hartree
oneelecener: -5475.23603183 hartree
twoeener: 2305.58463942 hartree
cpcmener: -0.02394556 hartree
kineticenergy: 1318.15435098 hartree
xcener: -106.458107095136 hartree
chargesum: 0.0000000
charge: -0.105524 -0.434977 0.137824 -0.393290 -0.406022 0.460444 0.225320 -0.377102 -0.206561 -0.375496 -0.348652 -0.356535 -0.050299 0.034662 0.051306 -0.210476 -0.223907 0.088438 -0.161522 -0.149652 0.092718 0.110694 0.116747 0.144867 0.123012 0.095286 0.098951 0.105274 0.097483 0.095368 0.100422 0.096784 0.100048 0.102848 0.096523 0.103897 0.218428 0.178475 0.137935 0.141455 0.161455 0.141498 0.141851
qa: -0.1055 -0.4350 0.1378 -0.3933 -0.4060 0.4604 0.2253 -0.3771 -0.2066 -0.3755 -0.3487 -0.3565 -0.0503 0.0347 0.0513 -0.2105 -0.2239 0.0884 -0.1615 -0.1497 0.0927 0.1107 0.1167 0.1449 0.1230 0.0953 0.0990 0.1053 0.0975 0.0954 0.1004 0.0968 0.1000 0.1028 0.0965 0.1039 0.2184 0.1785 0.1379 0.1415 0.1615 0.1415 0.1419
va: 1.1998 1.9974 3.3145 2.8290 2.9992 3.5635 3.7358 3.9336 3.9394 3.9215 3.9175 3.9336 3.6800 3.5681 4.0244 3.9658 4.0053 4.0030 4.0309 3.9832 3.8176 1.0077 1.0036 0.9923 0.9996 0.9982 1.0051 1.0204 1.0050 1.0042 1.0173 1.0047 1.0049 1.0024 1.0239 1.0331 1.0552 0.9920 1.0184 1.0036 0.9956 1.0076 1.0056
dispcorr: -0.024293331 hartree
energy: -1322.764596926608
dipole: -41.33174 39.65775 -1.67399 -1.08535 1.01787 -0.06747 3.18810 -4.08632 -0.89822
magnitude: 1.90095 au
magnitude: 4.83183 debye
