program: Orca
programVersion: 4.2.1
elementType: Cl O N N N C C C C C C C C C C C C C C C C H H H H H H H H H H H H H H H H H H H H H H
charge: 0
multiplicity: 1
keywords: wb97x-d3
keywords: def2-TZVPP
keywords: def2/J RIJCOSX GRIDX6 NOFINALGRIDX
keywords: grid4 nofinalgrid
keywords: scfconv7
keywords: smallprint printgap noloewdin
keywords: NOSOSCF
formula: C16H22ClN3O
InChI: InChI=1S/C16H22ClN3O/c1-15(2,3)16(21,10-20-12-18-11-19-20)9-8-13-4-6-14(17)7-5-13/h4-7,11-12,21H,8-10H2,1-3H3
43 atoms
Cl 5.37082 2.27917 0.112986
O  -2.6374 -0.804453 1.783193
N  -1.195753 -2.505832 -0.172531
N  -0.960498 -2.966888 1.058975
N  0.620154 -3.683626 -0.346157
C  -2.3717 -0.39826 0.453161
C  -3.581571 0.509697 0.042031
C  -1.001043 0.3133 0.473456
C  -2.321528 -1.641422 -0.4618
C  -3.472513 1.879286 0.719473
C  -3.678105 0.724622 -1.473751
C  -4.906266 -0.125953 0.490366
C  -0.395178 0.819832 -0.839287
C  1.047543 1.194521 -0.639467
C  -0.245496 -2.941849 -0.999466
C  1.414599 2.502661 -0.338844
C  2.049957 0.228909 -0.699052
C  0.13904 -3.664868 0.908867
C  2.73857 2.846187 -0.105558
C  3.378464 0.550867 -0.470055
C  3.712028 1.863109 -0.173475
H  -0.283474 -0.380839 0.922508
H  -1.056631 1.14535 1.178493
H  -3.238732 -2.223556 -0.362856
H  -2.223835 -1.364781 -1.50904
H  -2.652538 2.480993 0.32302
H  -3.33841 1.79543 1.79903
H  -4.390028 2.447455 0.551026
H  -4.452946 1.464528 -1.684499
H  -3.964906 -0.182469 -2.008904
H  -2.759017 1.097459 -1.923245
H  -5.739655 0.459112 0.095126
H  -5.037045 -1.144807 0.12075
H  -5.014061 -0.150058 1.57361
H  -0.942546 1.689413 -1.205455
H  -0.462723 0.061578 -1.623467
H  -2.004271 -1.496012 2.025781
H  -0.226053 -2.703541 -2.051773
H  0.657081 3.275639 -0.285799
H  1.799297 -0.799942 -0.930548
H  0.607424 -4.176467 1.735174
H  3.003232 3.869494 0.12443
H  4.141262 -0.214206 -0.525025
elementType: Cl O N C H
totalener: -1322.73891281 hartree
nucrepener: 1848.24971914 hartree
electener: -3170.98863195 hartree
oneelecener: -5477.77356056 hartree
twoeener: 2306.78492860 hartree
cpcmener: -0.02541688 hartree
kineticenergy: 1318.16858367 hartree
xcener: -106.461373534071 hartree
chargesum: -0.0000000
charge: -0.104331 -0.446966 0.147937 -0.389463 -0.407170 0.504540 0.209486 -0.335886 -0.256562 -0.357838 -0.373562 -0.357026 -0.100201 0.026416 0.032930 -0.208821 -0.220951 0.087020 -0.153769 -0.158961 0.102096 0.113342 0.116656 0.149472 0.122462 0.096195 0.101987 0.098597 0.101793 0.099808 0.116801 0.096251 0.092742 0.098498 0.097241 0.112378 0.216906 0.184346 0.138319 0.161552 0.163159 0.142156 0.140419
qa: -0.1043 -0.4470 0.1479 -0.3895 -0.4072 0.5045 0.2095 -0.3359 -0.2566 -0.3578 -0.3736 -0.3570 -0.1002 0.0264 0.0329 -0.2088 -0.2210 0.0870 -0.1538 -0.1590 0.1021 0.1133 0.1167 0.1495 0.1225 0.0962 0.1020 0.0986 0.1018 0.0998 0.1168 0.0963 0.0927 0.0985 0.0972 0.1124 0.2169 0.1843 0.1383 0.1616 0.1632 0.1422 0.1404
va: 1.2006 1.9960 3.2819 2.8554 2.9947 3.6046 3.6512 4.0092 3.9648 3.9204 3.9312 3.9560 3.7009 3.5473 4.0257 4.0071 3.9582 4.0120 3.9883 4.0315 3.8116 1.0180 1.0107 0.9956 0.9881 0.9982 1.0171 1.0075 1.0061 0.9962 0.9990 1.0022 1.0070 1.0145 1.0167 1.0063 1.0629 0.9882 1.0046 0.9985 0.9935 1.0058 1.0092
dispcorr: -0.024422381 hartree
energy: -1322.763335195058
dipole: -42.43745 40.93656 -1.50089 1.48161 -1.09648 0.38513 -3.49585 2.04510 -1.45075
magnitude: 2.12266 au
magnitude: 5.39536 debye
