program: Gaussian 09
title: 000030777
version: EM64L-G09RevD.01
frameworkgroup: C1[X(C15H27N3O2)]
method: RPBEPBE
basis: SDD
operation: Freq
keyword: #p
keyword: freq=noraman
keyword: PBEPBE/SDD
title: #p freq=noraman PBEPBE/SDD
converged: NO YES NO NO
title: Mulliken charges:
elementType: O O N N N C C C C C C C C C C C C C C C H H H H H H H H H H H H H H H H H H H H H H H H H H H
charge: -0.243515 -0.208300 -0.213484 -0.029078 -0.395505 0.052065 -0.039727 -0.411084 -0.402723 0.191878 -0.050359 -0.755755 -0.383581 -0.745462 0.231529 -0.696917 -0.672912 -0.355482 -0.362315 -0.658643 0.202844 0.229942 0.218083 0.202063 0.241041 0.212105 0.258441 0.222231 0.190356 0.200958 0.229977 0.251025 0.209441 0.213732 0.213223 0.214625 0.243310 0.227160 0.295258 0.319109 0.274360 0.222331 0.215303 0.187250 0.229698 0.208705 0.216801
chargesum: 0.00000
title: Mulliken charges with hydrogens summed into heavy atoms:
elementType: O O N N N C C C C C C C C C C C C C C C
charge: -0.243515 -0.208300 -0.213484 -0.029078 -0.076396 0.052065 0.163117 0.036941 0.040381 0.191878 -0.050359 -0.062979 0.007734 -0.055019 0.231529 -0.055337 0.092816 0.141209 0.040237 -0.003439
polarizability: 2.24578308e+02 -1.79206948e+01 1.85665880e+02 -4.60869024e+00 -8.44462160e+00 1.71140232e+02
1716.lowfreq: -6.1216 -0.0008 -0.0007 -0.0006 6.7351 11.7963 16.9607 27.3909 38.5028
frequency: 16.7763 27.1005 38.3696 50.9374 68.3335 71.8974 83.5953 108.7230 119.2033 131.3941 145.9810 162.9151 181.1642 194.0997 195.7982 203.2724 210.5230 225.4299 229.1964 236.5052 268.5153 288.0454 296.2106 307.5224 317.9478 334.6732 373.0481 392.6435 395.8128 430.3706 440.8692 458.3676 496.2761 523.5315 551.7111 611.9097 644.9229 680.9537 690.3799 702.1861 724.0240 739.5919 769.5670 782.7672 845.1044 854.9669 860.5155 877.7112 904.3526 917.3771 922.3012 939.5933 961.2880 996.6167 1001.1788 1017.9775 1033.5563 1065.4287 1088.4289 1089.5391 1092.3235 1102.7923 1114.9305 1119.1124 1121.1293 1154.4751 1166.3040 1169.2859 1192.4297 1228.0144 1237.3645 1251.2262 1267.2415 1275.8222 1288.0675 1296.1097 1299.9027 1305.3372 1317.6128 1325.4700 1338.7818 1342.7218 1352.8206 1353.4976 1384.2309 1388.7498 1394.1684 1397.9138 1423.6824 1446.8840 1464.3142 1465.7450 1470.0262 1473.0169 1474.9142 1475.9314 1476.9601 1477.9344 1482.4605 1484.6327 1486.2741 1488.6583 1489.6671 1499.9289 1518.1764 1562.2523 1588.3922 1633.0899 2953.9985 2962.8143 2964.5561 2973.1894 2975.0313 2979.3678 2982.3209 2984.7244 2987.7760 2991.1121 3008.8165 3021.4006 3027.5473 3042.7040 3062.9802 3070.6166 3071.8234 3073.0625 3078.7004 3078.9525 3080.8547 3080.9898 3086.5558 3097.6460 3102.1855 3110.1283 3569.6668
redmass: 3.1904 3.3071 3.1095 1.9506 2.9979 3.1926 3.2398 2.4344 1.8765 2.4226 4.7918 2.7594 2.3774 1.4425 2.4045 3.1950 1.1350 1.4228 1.4214 1.4864 2.8172 3.1493 2.4283 2.2988 2.8533 3.1432 2.8911 4.5429 4.2034 3.4004 2.2657 3.5869 3.3505 1.4126 4.1266 4.8839 4.5020 4.5652 7.6856 6.2538 3.6732 1.1160 1.5214 1.4680 2.1440 2.1241 2.0586 1.7874 1.5770 2.2407 2.2648 2.3877 2.1493 1.4993 1.6926 2.0690 2.6803 2.4039 2.1964 2.5551 2.4946 1.9696 2.0607 1.8182 1.5784 2.5481 2.6523 2.1260 2.8500 2.4311 1.3837 1.9361 1.3607 1.3220 1.5866 1.8938 1.6616 1.2471 1.3222 1.3331 1.3909 1.4803 1.3358 1.4290 1.2076 1.2096 1.1982 1.2189 1.2082 1.0834 1.0698 1.0930 1.0661 1.0585 1.0886 1.0436 1.0503 1.0634 1.0685 1.0640 1.0505 1.0791 1.0518 1.1198 1.6806 8.1213 8.8290 10.4075 1.0816 1.0597 1.0637 1.0363 1.0365 1.0610 1.0639 1.0405 1.0355 1.0367 1.0978 1.0598 1.0966 1.1023 1.1008 1.1003 1.0999 1.0997 1.0992 1.0990 1.0969 1.0985 1.0993 1.0996 1.1024 1.0978 1.0764
irintensity: 0.2331 1.5152 0.2530 0.5120 2.0942 0.6755 2.6326 0.9426 0.3403 0.7338 2.0301 0.1692 0.2056 0.1097 3.8084 5.6797 0.5116 1.7187 0.3260 0.5283 0.7154 0.5501 0.9058 3.6146 1.0868 2.4933 0.6890 5.6161 2.1819 16.0604 4.6274 11.3869 13.2996 88.2058 2.8786 0.6816 3.7295 1.7683 5.5271 11.2849 4.8262 7.3943 0.9860 24.1106 4.8569 5.8739 3.1872 8.4155 5.9532 19.9101 11.7863 2.4834 9.0742 8.0761 5.6353 20.9163 15.7026 11.9811 4.3290 10.8791 16.9311 23.5960 57.6518 6.6779 1.3451 80.5636 24.1890 10.6526 70.3249 3.7754 0.8583 8.8765 23.2949 45.0533 107.8223 13.3945 70.4066 0.8304 1.1010 3.9968 4.0863 17.4103 12.3939 7.8256 23.8774 10.8037 30.9420 13.0605 57.5062 24.1984 16.3958 20.6070 13.4014 22.0095 82.8951 11.5256 4.7254 1.5499 59.4964 16.4790 15.0382 14.8471 10.6240 47.6715 170.2289 808.0195 288.5412 24.2566 10.7208 18.5525 29.5546 37.0014 48.4396 49.8747 84.8135 8.5068 35.2472 19.3903 8.9615 17.5211 25.7007 19.4233 22.8896 58.6341 49.0918 21.5553 62.3144 21.3733 23.5284 28.8385 30.4352 28.0826 21.7061 1.4589 44.8288
temp: 298.150 k
press: 1.00000 atm
elementType: 8 8 7 7 7 6 6 6 6 6 6 6 6 6 6 6 6 6 6 6 1 1 1 1 1 1 1 1 1 1 1 1 1 1 1 1 1 1 1 1 1 1 1 1 1 1 1
symmnumber: 1
zpe: 1063954.5 jmol-1
zpe.correction: 0.405239 hartree
zpe.thermalcorrener: 0.428779 hartree
zpe.thermalcorrenthalpy: 0.429723 hartree
zpe.thermalcorrgfe: 0.351429 hartree
zpe.sumelectzpe: -900.931262 hartree
zpe.sumelectthermal: -900.907723 hartree
zpe.sumelectthermalent: -900.906778 hartree
zpe.sumelectthermalfe: -900.985072 hartree
dipole: 3.1013 -6.0838 1.5881
dipole: 7.0109
quadrupole: -109.1680 -126.9834 -129.5508
quadrupole: -9.9797 8.4901 3.3546
quadrupole: 12.7327 -5.0827 -7.6500 -9.9797 8.4901 3.3546
hfenergy: -901.3365011 hartree
pointgroup: C01 [X(C15H27N3O2)]
dipole: 1.339498 2.3705407 -0.4410005 debye
polarizability: 226.0446211|15.7490969|185.1910331|6.0857286|-7.4494313|170.1487651 unknown
InChI: InChI=1S/C15H27N3O2/c1-6-9-11(4)15(8-3)12(19)17-14(16-10-7-2)18(5)13(15)20/h11,16H,6-10H2,1-5H3
charge 0 multiplicity 1
47 atoms
O  -1.166206 0.183338 -2.375765
O  0.070677 -2.493855 1.282212
N  0.751757 0.675519 -1.153859
N  1.304752 -0.571195 0.859607
N  2.648959 1.211631 0.16209
C  -1.017937 -0.775592 -0.103759
C  -1.736793 0.297103 0.867819
C  -2.00283 -1.880401 -0.568375
C  -3.010928 0.910262 0.222286
C  -0.509243 0.026819 -1.309803
C  0.166419 -1.374986 0.707319
C  -2.050709 -0.310358 2.256349
C  -3.393577 2.285852 0.821517
C  -1.381405 -2.934102 -1.510884
C  1.54561 0.407829 -0.00543
C  -4.6801 2.8612 0.190693
C  1.226917 1.551698 -2.244504
C  3.617404 1.029432 1.260799
C  5.06958 0.902188 0.746593
C  5.307199 -0.364362 -0.101936
H  -1.005072 1.119917 1.020544
H  -2.85445 -1.398463 -1.078949
H  -2.384325 -2.389787 0.333829
H  -3.861134 0.211583 0.355781
H  -2.873239 1.031509 -0.86949
H  -2.573442 0.438387 2.878527
H  -1.13914 -0.620847 2.793488
H  -2.707225 -1.193925 2.169299
H  -2.555317 2.996343 0.665247
H  -3.530444 2.201475 1.917994
H  -1.021033 -2.47179 -2.447194
H  -0.546189 -3.461213 -1.0192
H  -2.140511 -3.689348 -1.785188
H  -4.566121 2.979077 -0.903321
H  -5.541266 2.189277 0.36596
H  -4.931427 3.850631 0.615191
H  2.209608 1.217336 -2.622285
H  1.28271 2.609279 -1.922572
H  0.485976 1.478123 -3.055616
H  2.815503 1.97378 -0.494929
H  3.304102 0.118426 1.797423
H  3.535466 1.88277 1.963704
H  5.734801 0.89073 1.632094
H  5.345383 1.80828 0.166834
H  5.09844 -1.276163 0.486067
H  4.646911 -0.384703 -0.988454
H  6.352391 -0.416006 -0.456552
