program: Orca
programVersion: 4.2.1
elementType: Cl O N N N C C C C C C C C C C C C C C C C H H H H H H H H H H H H H H H H H H H H H H
charge: 0
multiplicity: 1
keywords: wb97x-d3
keywords: def2-TZVPP
keywords: def2/J RIJCOSX GRIDX6 NOFINALGRIDX
keywords: grid4 nofinalgrid
keywords: scfconv7
keywords: smallprint printgap noloewdin
keywords: NOSOSCF
formula: C16H22ClN3O
InChI: InChI=1S/C16H22ClN3O/c1-15(2,3)16(21,10-20-12-18-11-19-20)9-8-13-4-6-14(17)7-5-13/h4-7,11-12,21H,8-10H2,1-3H3
43 atoms
Cl 5.046708 2.553873 -1.732285
O  -2.500743 -0.185423 1.819581
N  -1.286019 -2.510757 0.627441
N  -0.242877 -2.800899 -0.154062
N  0.106239 -3.558287 1.921977
C  -2.386448 -0.274734 0.413181
C  -3.6155 0.420081 -0.273292
C  -1.05385 0.335416 -0.091786
C  -2.431797 -1.784131 0.129783
C  -4.922346 -0.309709 0.060927
C  -3.754586 1.860781 0.236258
C  -3.457459 0.460188 -1.796396
C  0.091614 0.392726 0.926489
C  1.338827 0.9301 0.281866
C  -1.064376 -2.966964 1.861769
C  1.575503 2.300791 0.215091
C  2.271587 0.074584 -0.29836
C  0.567766 -3.426764 0.663492
C  2.707865 2.809497 -0.403634
C  3.412697 0.561987 -0.917619
C  3.621089 1.93105 -0.964572
H  -1.219263 1.357026 -0.440158
H  -0.719577 -0.215385 -0.974411
H  -3.314514 -2.224563 0.591268
H  -2.487362 -1.979575 -0.938562
H  -5.774384 0.292915 -0.257221
H  -5.032652 -0.484191 1.131898
H  -5.013657 -1.269098 -0.449568
H  -2.850715 2.457615 0.102639
H  -4.036626 1.906888 1.290136
H  -4.546966 2.368802 -0.315629
H  -3.33186 -0.531136 -2.235215
H  -4.352728 0.8916 -2.249011
H  -2.61386 1.072137 -2.117821
H  0.301068 -0.585964 1.357633
H  -0.180105 1.042754 1.761232
H  -2.405458 0.732421 2.094004
H  -1.772746 -2.857487 2.66738
H  0.868103 2.992578 0.657894
H  2.109388 -0.995945 -0.267369
H  1.521733 -3.81029 0.33552
H  2.874822 3.87768 -0.441307
H  4.129192 -0.121235 -1.354117
elementType: Cl O N C H
totalener: -1322.73945633 hartree
nucrepener: 1843.77119458 hartree
electener: -3166.51065092 hartree
oneelecener: -5469.15968838 hartree
twoeener: 2302.64903746 hartree
cpcmener: -0.02622475 hartree
kineticenergy: 1318.16766971 hartree
xcener: -106.458180382144 hartree
chargesum: 0.0000000
charge: -0.106005 -0.418830 0.118934 -0.352884 -0.405095 0.488648 0.181694 -0.368694 -0.214257 -0.364275 -0.361423 -0.345766 -0.049755 0.044436 0.062881 -0.230294 -0.220024 0.047806 -0.144867 -0.156371 0.090963 0.116312 0.113774 0.139395 0.127733 0.099204 0.101303 0.096610 0.110437 0.096062 0.098097 0.099906 0.099689 0.098275 0.100084 0.092814 0.210232 0.164319 0.139639 0.153007 0.164911 0.141262 0.140112
qa: -0.1060 -0.4188 0.1189 -0.3529 -0.4051 0.4886 0.1817 -0.3687 -0.2143 -0.3643 -0.3614 -0.3458 -0.0498 0.0444 0.0629 -0.2303 -0.2200 0.0478 -0.1449 -0.1564 0.0910 0.1163 0.1138 0.1394 0.1277 0.0992 0.1013 0.0966 0.1104 0.0961 0.0981 0.0999 0.0997 0.0983 0.1001 0.0928 0.2102 0.1643 0.1396 0.1530 0.1649 0.1413 0.1401
va: 1.1993 2.0121 3.3596 2.8447 3.0277 3.5523 3.8338 3.9045 3.8916 3.9100 3.9235 3.9383 3.7317 3.5638 4.0578 4.0065 3.9649 4.0330 3.9777 4.0290 3.8169 1.0077 1.0164 0.9946 1.0174 1.0054 1.0222 0.9961 1.0007 1.0088 1.0052 1.0061 1.0044 1.0023 1.0120 1.0261 1.0271 1.0073 1.0044 1.0015 0.9952 1.0055 1.0084
dispcorr: -0.024224615 hartree
energy: -1322.763680948882
dipole: -42.04816 39.59415 -2.45401 -0.24981 1.36013 1.11032 2.20978 -2.29448 -0.08470
magnitude: 2.69484 au
magnitude: 6.84973 debye
