program: Orca
programVersion: 4.2.1
elementType: Cl O N N N C C C C C C C C C C C C C C C C H H H H H H H H H H H H H H H H H H H H H H
charge: 0
multiplicity: 1
keywords: wb97x-d3
keywords: def2-TZVPP
keywords: def2/J RIJCOSX GRIDX6 NOFINALGRIDX
keywords: grid4 nofinalgrid
keywords: scfconv7
keywords: smallprint printgap noloewdin
keywords: NOSOSCF
formula: C16H22ClN3O
InChI: InChI=1S/C16H22ClN3O/c1-15(2,3)16(21,10-20-12-18-11-19-20)9-8-13-4-6-14(17)7-5-13/h4-7,11-12,21H,8-10H2,1-3H3
43 atoms
Cl 5.40571 2.170261 -0.475111
O  -2.294732 -0.929971 1.678381
N  -1.341391 -2.689438 -0.420667
N  -0.465082 -2.774566 -1.42474
N  0.148432 -4.114303 0.258841
C  -2.290735 -0.495076 0.330989
C  -3.512119 0.454821 0.053984
C  -0.915031 0.100008 -0.030233
C  -2.47467 -1.793716 -0.480431
C  -3.675862 1.497147 1.16923
C  -3.351711 1.182343 -1.283278
C  -4.829546 -0.333849 0.015128
C  -0.448752 1.372656 0.687008
C  1.01268 1.606835 0.42167
C  -0.961148 -3.489411 0.577801
C  1.984752 0.916638 1.142362
C  1.430752 2.476365 -0.580309
C  0.408486 -3.638612 -0.973814
C  3.33446 1.083413 0.876198
C  2.777358 2.65753 -0.862943
C  3.719749 1.955385 -0.13042
H  -0.856525 0.266433 -1.108442
H  -0.169502 -0.667807 0.18828
H  -3.339867 -2.340683 -0.10953
H  -2.646225 -1.577836 -1.533023
H  -3.935003 1.039833 2.125604
H  -4.497042 2.169904 0.914086
H  -2.799946 2.124647 1.322516
H  -4.260402 1.74197 -1.514403
H  -3.182768 0.497116 -2.116713
H  -2.530867 1.901028 -1.275171
H  -4.920556 -0.973253 -0.864319
H  -4.962573 -0.95494 0.903045
H  -5.671085 0.360946 -0.019426
H  -0.601843 1.293469 1.767256
H  -1.014609 2.242317 0.353379
H  -2.039433 -0.201501 2.253252
H  -1.515726 -3.591188 1.496269
H  1.688975 0.234074 1.930696
H  0.697432 3.028295 -1.156282
H  1.261579 -3.943405 -1.560174
H  4.07366 0.539599 1.448819
H  3.082077 3.339213 -1.645644
elementType: Cl O N C H
totalener: -1322.73755629 hartree
nucrepener: 1830.33569733 hartree
electener: -3153.07325362 hartree
oneelecener: -5442.16950651 hartree
twoeener: 2289.09625289 hartree
cpcmener: -0.02744970 hartree
kineticenergy: 1318.17528779 hartree
xcener: -106.458868644032 hartree
chargesum: -0.0000000
charge: -0.104523 -0.426678 0.098206 -0.351050 -0.409221 0.479950 0.166399 -0.347151 -0.170187 -0.381625 -0.351024 -0.364366 -0.038248 0.016183 0.065776 -0.236133 -0.190990 0.053718 -0.151425 -0.161091 0.095494 0.107338 0.114861 0.141234 0.127393 0.103987 0.099905 0.122022 0.099603 0.102775 0.098106 0.096646 0.101026 0.098940 0.100227 0.084211 0.218319 0.164714 0.141366 0.139030 0.161621 0.142680 0.141983
qa: -0.1045 -0.4267 0.0982 -0.3510 -0.4092 0.4799 0.1664 -0.3472 -0.1702 -0.3816 -0.3510 -0.3644 -0.0382 0.0162 0.0658 -0.2361 -0.1910 0.0537 -0.1514 -0.1611 0.0955 0.1073 0.1149 0.1412 0.1274 0.1040 0.0999 0.1220 0.0996 0.1028 0.0981 0.0966 0.1010 0.0989 0.1002 0.0842 0.2183 0.1647 0.1414 0.1390 0.1616 0.1427 0.1420
va: 1.2008 2.0197 3.3691 2.8646 3.0379 3.6465 3.7546 3.9292 3.8432 3.9208 3.9434 3.9195 3.7424 3.5765 4.0768 3.9900 3.9731 4.0526 3.9904 3.9954 3.8233 1.0097 1.0052 0.9956 1.0182 1.0094 1.0058 0.9930 1.0061 1.0050 1.0010 0.9966 1.0167 1.0057 1.0118 1.0181 1.0251 1.0094 1.0067 1.0042 0.9958 1.0055 1.0064
dispcorr: -0.023311096 hartree
energy: -1322.760867388043
dipole: -43.06109 40.70201 -2.35908 3.07163 -1.53260 1.53903 2.29200 -1.86802 0.42398
magnitude: 2.84845 au
magnitude: 7.24017 debye
