program: Orca
programVersion: 4.2.1
elementType: Cl O N N N C C C C C C C C C C C C C C C C H H H H H H H H H H H H H H H H H H H H H H
charge: 0
multiplicity: 1
keywords: wb97x-d3
keywords: def2-TZVPP
keywords: def2/J RIJCOSX GRIDX6 NOFINALGRIDX
keywords: grid4 nofinalgrid
keywords: scfconv7
keywords: smallprint printgap noloewdin
keywords: NOSOSCF
formula: C16H22ClN3O
InChI: InChI=1S/C16H22ClN3O/c1-15(2,3)16(21,10-20-12-18-11-19-20)9-8-13-4-6-14(17)7-5-13/h4-7,11-12,21H,8-10H2,1-3H3
43 atoms
Cl 5.113469 2.17682 -1.862927
O  -2.549531 0.029979 1.871211
N  -1.205258 -2.393323 0.726413
N  -0.903689 -2.638756 2.002377
N  0.728325 -3.380063 0.66005
C  -2.421049 -0.198168 0.483497
C  -3.666691 0.384986 -0.277302
C  -1.105156 0.403709 -0.068713
C  -2.42671 -1.729851 0.333627
C  -4.946433 -0.370122 0.101624
C  -3.876568 1.856532 0.103206
C  -3.485736 0.306187 -1.796599
C  0.038938 0.545543 0.944745
C  1.314169 0.953637 0.26154
C  -0.227134 -2.843538 -0.062843
C  1.555136 2.286011 -0.066085
C  2.276107 0.009176 -0.087043
C  0.262057 -3.230019 1.915929
C  2.715995 2.671587 -0.719344
C  3.444096 0.373896 -0.740694
C  3.654157 1.707115 -1.052414
H  -1.294044 1.397514 -0.481003
H  -0.764088 -0.188873 -0.922259
H  -3.23233 -2.162899 0.924791
H  -2.601475 -2.003505 -0.704985
H  -5.815789 0.138591 -0.32003
H  -5.089949 -0.41465 1.182435
H  -4.967516 -1.390734 -0.283952
H  -4.682969 2.278147 -0.499664
H  -2.997354 2.479561 -0.07337
H  -4.176062 1.98259 1.145683
H  -3.320471 -0.711943 -2.154349
H  -4.387868 0.668746 -2.293724
H  -2.658171 0.919505 -2.155227
H  0.203869 -0.375742 1.501789
H  -0.222573 1.30266 1.687229
H  -2.510155 0.976238 2.044561
H  -0.25604 -2.766136 -1.138958
H  0.829522 3.046102 0.199442
H  2.123239 -1.03504 0.159423
H  0.796232 -3.568677 2.79029
H  2.886639 3.712621 -0.958999
H  4.180457 -0.376048 -0.997225
elementType: Cl O N C H
totalener: -1322.73742420 hartree
nucrepener: 1848.50612552 hartree
electener: -3171.24354971 hartree
oneelecener: -5478.59332089 hartree
twoeener: 2307.34977118 hartree
cpcmener: -0.03043639 hartree
kineticenergy: 1318.16030657 hartree
xcener: -106.456812728405 hartree
chargesum: -0.0000000
charge: -0.105464 -0.405671 0.131428 -0.348096 -0.411854 0.505435 0.168217 -0.395867 -0.221434 -0.354861 -0.363777 -0.344343 -0.049596 0.032789 0.039116 -0.224311 -0.206238 0.071566 -0.153065 -0.165730 0.095448 0.116916 0.115574 0.122268 0.140478 0.098952 0.102175 0.095507 0.098429 0.111352 0.095692 0.098796 0.100085 0.098472 0.100692 0.098909 0.209030 0.173966 0.141427 0.146391 0.158982 0.141830 0.140383
qa: -0.1055 -0.4057 0.1314 -0.3481 -0.4119 0.5054 0.1682 -0.3959 -0.2214 -0.3549 -0.3638 -0.3443 -0.0496 0.0328 0.0391 -0.2243 -0.2062 0.0716 -0.1531 -0.1657 0.0954 0.1169 0.1156 0.1223 0.1405 0.0990 0.1022 0.0955 0.0984 0.1114 0.0957 0.0988 0.1001 0.0985 0.1007 0.0989 0.2090 0.1740 0.1414 0.1464 0.1590 0.1418 0.1404
va: 1.1998 2.0262 3.3536 2.8635 3.0015 3.4944 3.8542 3.9519 3.9190 3.9069 3.9226 3.9299 3.6966 3.5820 4.0398 4.0090 3.9495 4.0111 3.9861 4.0443 3.8159 1.0096 0.9990 1.0143 0.9946 1.0059 1.0212 0.9980 1.0051 1.0003 1.0094 1.0076 1.0053 1.0014 1.0349 1.0240 1.0255 0.9950 1.0032 1.0238 0.9970 1.0058 1.0089
dispcorr: -0.024392345 hartree
energy: -1322.761816542398
dipole: -42.52426 40.30820 -2.21606 0.61595 0.45693 1.07288 1.20231 -2.22009 -1.01778
magnitude: 2.66418 au
magnitude: 6.77181 debye
