program: Orca
programVersion: 4.2.1
elementType: Cl O N N N C C C C C C C C C C C C C C C C H H H H H H H H H H H H H H H H H H H H H H
charge: 0
multiplicity: 1
keywords: wb97x-d3
keywords: def2-TZVPP
keywords: def2/J RIJCOSX GRIDX6 NOFINALGRIDX
keywords: grid4 nofinalgrid
keywords: scfconv7
keywords: smallprint printgap noloewdin
keywords: NOSOSCF
formula: C16H22ClN3O
InChI: InChI=1S/C16H22ClN3O/c1-15(2,3)16(21,10-20-12-18-11-19-20)9-8-13-4-6-14(17)7-5-13/h4-7,11-12,21H,8-10H2,1-3H3
43 atoms
Cl 4.049355 3.574759 1.174393
O  -0.696011 -0.408184 1.086444
N  -1.335721 -2.884203 -0.390966
N  -0.227059 -3.14172 0.310054
N  -0.282574 -4.397917 -1.536076
C  -1.696665 -0.467272 0.095857
C  -2.804133 0.546635 0.538394
C  -1.145242 -0.102257 -1.308443
C  -2.287815 -1.893051 0.064661
C  -3.487162 0.0930 1.834957
C  -2.172698 1.918673 0.804096
C  -3.882608 0.707802 -0.537642
C  0.349882 -0.325392 -1.558793
C  1.262783 0.645225 -0.857683
C  -1.353867 -3.637933 -1.489285
C  2.249999 0.20681 0.018791
C  1.166585 2.013633 -1.09762
C  0.374358 -4.0548 -0.414868
C  3.111252 1.094771 0.646414
C  2.013341 2.920071 -0.47854
C  2.981531 2.450456 0.394483
H  -1.352053 0.945861 -1.527762
H  -1.703734 -0.654759 -2.069401
H  -2.618948 -2.195761 1.057511
H  -3.143956 -1.953167 -0.604326
H  -2.766641 -0.146023 2.617859
H  -4.13326 -0.77519 1.691868
H  -4.1256 0.8931 2.215269
H  -1.462848 1.892089 1.629625
H  -2.953702 2.635436 1.066862
H  -1.65091 2.32416 -0.063974
H  -3.491002 1.10055 -1.476542
H  -4.403353 -0.225145 -0.761525
H  -4.641692 1.413044 -0.193073
H  0.504205 -0.218537 -2.636474
H  0.661383 -1.344399 -1.326751
H  -0.159526 -1.21239 1.05248
H  -2.156197 -3.60725 -2.209798
H  2.357133 -0.852386 0.222265
H  0.421813 2.392118 -1.787994
H  1.317908 -4.486456 -0.119219
H  3.87013 0.729392 1.325345
H  1.919391 3.978584 -0.681601
elementType: Cl O N C H
totalener: -1322.73672598 hartree
nucrepener: 1886.18736683 hartree
electener: -3208.92409282 hartree
oneelecener: -5554.23227987 hartree
twoeener: 2345.30818705 hartree
cpcmener: -0.02564173 hartree
kineticenergy: 1318.17553090 hartree
xcener: -106.464239953811 hartree
chargesum: 0.0000000
charge: -0.109579 -0.427534 0.124884 -0.392966 -0.402631 0.440983 0.216771 -0.284726 -0.213402 -0.372914 -0.354542 -0.353924 -0.129172 0.167774 0.066022 -0.237305 -0.305215 0.085598 -0.143167 -0.127475 0.078357 0.103272 0.109381 0.145070 0.118285 0.104498 0.092640 0.098311 0.100268 0.100351 0.089031 0.099949 0.097603 0.100720 0.109443 0.095528 0.211456 0.175598 0.133791 0.143972 0.162623 0.140566 0.141809
qa: -0.1096 -0.4275 0.1249 -0.3930 -0.4026 0.4410 0.2168 -0.2847 -0.2134 -0.3729 -0.3545 -0.3539 -0.1292 0.1678 0.0660 -0.2373 -0.3052 0.0856 -0.1432 -0.1275 0.0784 0.1033 0.1094 0.1451 0.1183 0.1045 0.0926 0.0983 0.1003 0.1004 0.0890 0.0999 0.0976 0.1007 0.1094 0.0955 0.2115 0.1756 0.1338 0.1440 0.1626 0.1406 0.1418
va: 1.1957 2.0084 3.3368 2.8237 3.0299 3.5859 3.7491 3.9197 3.9569 3.9224 3.9253 3.9319 3.8371 3.4444 4.0438 4.0033 4.0124 4.0093 4.0050 3.9592 3.8305 1.0045 1.0043 0.9909 1.0006 1.0212 0.9978 1.0054 1.0172 1.0075 1.0075 1.0020 1.0056 1.0050 1.0058 1.0066 1.0696 0.9922 1.0071 1.0005 0.9953 1.0057 1.0050
dispcorr: -0.025525090 hartree
energy: -1322.762251073699
dipole: -34.12916 31.88264 -2.24653 -4.28385 3.86875 -0.41511 -3.58646 2.56835 -1.01811
magnitude: 2.50115 au
magnitude: 6.35741 debye
