program: Orca
programVersion: 4.2.1
elementType: Cl O N N N C C C C C C C C C C C C C C C C H H H H H H H H H H H H H H H H H H H H H H
charge: 0
multiplicity: 1
keywords: wb97x-d3
keywords: def2-TZVPP
keywords: def2/J RIJCOSX GRIDX6 NOFINALGRIDX
keywords: grid4 nofinalgrid
keywords: scfconv7
keywords: smallprint printgap noloewdin
keywords: NOSOSCF
formula: C16H22ClN3O
InChI: InChI=1S/C16H22ClN3O/c1-15(2,3)16(21,10-20-12-18-11-19-20)9-8-13-4-6-14(17)7-5-13/h4-7,11-12,21H,8-10H2,1-3H3
43 atoms
Cl 5.221158 2.891259 -0.985167
O  -2.537379 0.471446 1.947362
N  -1.505903 -2.625485 0.219472
N  -0.252153 -2.589787 -0.236916
N  -1.358999 -4.306825 -1.148623
C  -2.174274 -0.205237 0.75538
C  -3.282435 0.005446 -0.338895
C  -0.841836 0.412515 0.318388
C  -1.993867 -1.680902 1.198986
C  -3.700757 1.482409 -0.382147
C  -2.800994 -0.373688 -1.744111
C  -4.541756 -0.812495 -0.023671
C  0.261969 0.424472 1.380047
C  1.514527 1.03727 0.820586
C  -2.150443 -3.659556 -0.327116
C  2.37522 0.285411 0.023178
C  1.824554 2.37574 1.041014
C  -0.210806 -3.60943 -1.057214
C  3.514564 0.844421 -0.534671
C  2.959699 2.954821 0.491258
C  3.797112 2.180368 -0.294141
H  -1.017661 1.443391 0.000319
H  -0.468407 -0.117326 -0.556922
H  -1.309645 -1.703787 2.047061
H  -2.94163 -2.076388 1.565112
H  -2.860929 2.155129 -0.559644
H  -4.199709 1.808064 0.530888
H  -4.405223 1.634712 -1.202481
H  -2.013581 0.289278 -2.10409
H  -3.631712 -0.287571 -2.447916
H  -2.432996 -1.396099 -1.820273
H  -5.35081 -0.515131 -0.693363
H  -4.404942 -1.88533 -0.164449
H  -4.914395 -0.657462 0.992774
H  0.484986 -0.59208 1.709673
H  -0.058809 0.983564 2.259946
H  -3.416505 0.192369 2.225795
H  -3.176026 -3.903231 -0.097624
H  2.151712 -0.758119 -0.167728
H  1.172485 2.984497 1.656225
H  0.684003 -3.86389 -1.604097
H  4.17306 0.243373 -1.147503
H  3.184564 3.996431 0.677806
elementType: Cl O N C H
totalener: -1322.73732317 hartree
nucrepener: 1835.03386615 hartree
electener: -3157.77118931 hartree
oneelecener: -5451.89593398 hartree
twoeener: 2294.12474466 hartree
cpcmener: -0.02666477 hartree
kineticenergy: 1318.16909946 hartree
xcener: -106.458128575974 hartree
chargesum: -0.0000000
charge: -0.107484 -0.415272 0.170343 -0.379627 -0.405723 0.431010 0.173509 -0.261077 -0.289272 -0.351625 -0.361305 -0.345062 -0.024507 0.012169 0.047106 -0.223613 -0.228896 0.080964 -0.155153 -0.136167 0.086299 0.119995 0.094230 0.147074 0.137639 0.099609 0.092921 0.098556 0.103327 0.101020 0.101819 0.101756 0.100495 0.094767 0.090754 0.094749 0.210724 0.170393 0.148129 0.137391 0.156714 0.139773 0.141549
qa: -0.1075 -0.4153 0.1703 -0.3796 -0.4057 0.4310 0.1735 -0.2611 -0.2893 -0.3516 -0.3613 -0.3451 -0.0245 0.0122 0.0471 -0.2236 -0.2289 0.0810 -0.1552 -0.1362 0.0863 0.1200 0.0942 0.1471 0.1376 0.0996 0.0929 0.0986 0.1033 0.1010 0.1018 0.1018 0.1005 0.0948 0.0908 0.0947 0.2107 0.1704 0.1481 0.1374 0.1567 0.1398 0.1415
va: 1.1979 2.0369 3.2282 2.7989 3.0360 3.7168 3.7522 3.8298 3.9818 3.9445 3.9477 3.9246 3.6871 3.5863 4.0648 3.9597 4.0102 4.0109 4.0115 3.9643 3.8178 1.0150 1.0211 0.9997 0.9902 1.0042 1.0158 1.0035 0.9962 1.0072 1.0014 1.0077 1.0027 1.0108 1.0246 1.0349 1.0256 0.9952 1.0146 1.0063 0.9949 1.0078 1.0054
dispcorr: -0.024132974 hartree
energy: -1322.761456141749
dipole: -39.68917 37.16766 -2.52151 -5.48653 5.34759 -0.13895 2.56829 -1.58967 0.97862
magnitude: 2.70832 au
magnitude: 6.88400 debye
