program: Orca
programVersion: 4.2.1
elementType: Cl O N N N C C C C C C C C C C C C C C C C H H H H H H H H H H H H H H H H H H H H H H
charge: 0
multiplicity: 1
keywords: wb97x-d3
keywords: def2-TZVPP
keywords: def2/J RIJCOSX GRIDX6 NOFINALGRIDX
keywords: grid4 nofinalgrid
keywords: scfconv7
keywords: smallprint printgap noloewdin
keywords: NOSOSCF
formula: C16H22ClN3O
InChI: InChI=1S/C16H22ClN3O/c1-15(2,3)16(21,10-20-12-18-11-19-20)9-8-13-4-6-14(17)7-5-13/h4-7,11-12,21H,8-10H2,1-3H3
43 atoms
Cl 4.911935 3.750137 -0.616681
O  -2.107233 -0.850679 1.668738
N  -1.439033 -2.836057 -0.13391
N  -0.336714 -3.276819 -0.747128
N  -0.85359 -4.614769 0.968218
C  -2.11126 -0.437983 0.318589
C  -3.423319 0.399992 0.123172
C  -0.867186 0.417625 0.02038
C  -2.178044 -1.686072 -0.610074
C  -4.640608 -0.353344 0.678456
C  -3.338272 1.732586 0.876431
C  -3.675409 0.699582 -1.358496
C  0.495197 -0.284434 0.093361
C  1.609597 0.710897 -0.076713
C  -1.739305 -3.650076 0.882549
C  2.119276 1.4147 1.011296
C  2.137754 0.977638 -1.336774
C  -0.017471 -4.337381 -0.050025
C  3.130728 2.350687 0.855951
C  3.148801 1.910676 -1.514064
C  3.639411 2.589904 -0.410826
H  -0.84975 1.250665 0.726047
H  -0.962797 0.860354 -0.973282
H  -3.209467 -2.00974 -0.73658
H  -1.796638 -1.456118 -1.602852
H  -5.540314 0.242174 0.510181
H  -4.564588 -0.527273 1.75184
H  -4.816169 -1.317615 0.197183
H  -2.61396 2.421391 0.441169
H  -3.084883 1.592414 1.928199
H  -4.30672 2.235232 0.841088
H  -2.854139 1.247519 -1.823527
H  -3.853274 -0.198951 -1.951989
H  -4.566826 1.321767 -1.460182
H  0.579907 -1.048108 -0.678634
H  0.628162 -0.79725 1.051003
H  -1.204493 -1.007938 1.96145
H  -2.602257 -3.514993 1.51413
H  1.729898 1.229573 2.005534
H  1.761578 0.44534 -2.202399
H  0.847168 -4.936636 -0.290104
H  3.518803 2.881322 1.715124
H  3.549609 2.098195 -2.501235
elementType: Cl O N C H
totalener: -1322.73637207 hartree
nucrepener: 1816.58222124 hartree
electener: -3139.31859331 hartree
oneelecener: -5414.32394632 hartree
twoeener: 2275.00535302 hartree
cpcmener: -0.02542735 hartree
kineticenergy: 1318.16408518 hartree
xcener: -106.457623060097 hartree
chargesum: -0.0000000
charge: -0.104940 -0.414686 0.113576 -0.363031 -0.415478 0.414135 0.230547 -0.337788 -0.218406 -0.340918 -0.375686 -0.359401 -0.020833 0.012910 0.060665 -0.226200 -0.206874 0.070370 -0.151028 -0.157788 0.093781 0.120673 0.098723 0.158189 0.130352 0.098140 0.100085 0.090073 0.096706 0.102648 0.099396 0.103876 0.096843 0.101256 0.091093 0.090365 0.221722 0.168319 0.140552 0.140274 0.161797 0.142716 0.143273
qa: -0.1049 -0.4147 0.1136 -0.3630 -0.4155 0.4141 0.2305 -0.3378 -0.2184 -0.3409 -0.3757 -0.3594 -0.0208 0.0129 0.0607 -0.2262 -0.2069 0.0704 -0.1510 -0.1578 0.0938 0.1207 0.0987 0.1582 0.1304 0.0981 0.1001 0.0901 0.0967 0.1026 0.0994 0.1039 0.0968 0.1013 0.0911 0.0904 0.2217 0.1683 0.1406 0.1403 0.1618 0.1427 0.1433
va: 1.2003 2.0425 3.3289 2.8538 3.0405 3.6783 3.6863 3.9232 3.8447 3.9150 3.9207 3.9387 3.6970 3.6091 4.0747 3.9917 3.9755 4.0233 3.9847 3.9892 3.8207 0.9971 1.0115 0.9887 1.0032 1.0045 1.0166 1.0081 0.9966 1.0185 1.0067 1.0037 1.0030 1.0044 1.0448 1.0159 1.0247 1.0068 1.0058 1.0042 0.9943 1.0055 1.0057
dispcorr: -0.023227343 hartree
energy: -1322.759599410907
dipole: -38.76793 37.35590 -1.41203 -4.13044 4.88227 0.75183 1.21662 -1.59204 -0.37542
magnitude: 1.64317 au
magnitude: 4.17661 debye
