program: Orca
programVersion: 4.2.1
elementType: Cl O N N N C C C C C C C C C C C C C C C C H H H H H H H H H H H H H H H H H H H H H H
charge: 0
multiplicity: 1
keywords: wb97x-d3
keywords: def2-TZVPP
keywords: def2/J RIJCOSX GRIDX6 NOFINALGRIDX
keywords: grid4 nofinalgrid
keywords: scfconv7
keywords: smallprint printgap noloewdin
keywords: NOSOSCF
formula: C16H22ClN3O
InChI: InChI=1S/C16H22ClN3O/c1-15(2,3)16(21,10-20-12-18-11-19-20)9-8-13-4-6-14(17)7-5-13/h4-7,11-12,21H,8-10H2,1-3H3
43 atoms
Cl 5.100627 3.268944 -0.719453
O  -2.16532 -1.176102 1.460223
N  -1.542387 -2.892769 -0.64674
N  -0.337623 -3.038167 -1.206293
N  -0.775869 -4.762257 0.150572
C  -2.104646 -0.607894 0.169218
C  -3.261377 0.441381 0.104871
C  -0.71601 0.023797 -0.118654
C  -2.36381 -1.724229 -0.874737
C  -2.925507 1.669911 0.955563
C  -3.500655 0.902401 -1.336947
C  -4.574537 -0.143587 0.642369
C  0.134629 0.388256 1.104371
C  1.384275 1.106695 0.677658
C  -1.78864 -3.928031 0.161025
C  2.426997 0.416237 0.062525
C  1.520082 2.48044 0.8506
C  0.083258 -4.169343 -0.69975
C  3.569593 1.070052 -0.370318
C  2.65733 3.154034 0.426831
C  3.674287 2.440063 -0.183813
H  -0.848284 0.913958 -0.73632
H  -0.123028 -0.655702 -0.735251
H  -3.400821 -2.054872 -0.845016
H  -2.157992 -1.377252 -1.885449
H  -3.775416 2.355687 0.960882
H  -2.074104 2.230614 0.566428
H  -2.717601 1.408536 1.993644
H  -2.596557 1.278798 -1.819189
H  -4.226551 1.717648 -1.347737
H  -3.90935 0.112433 -1.96942
H  -4.903366 -1.033987 0.103307
H  -4.514685 -0.398731 1.699834
H  -5.370758 0.595909 0.534119
H  0.423613 -0.51458 1.649781
H  -0.421414 1.009483 1.806224
H  -1.353321 -1.655493 1.650987
H  -2.707871 -4.036836 0.715017
H  2.354139 -0.655539 -0.082761
H  0.728856 3.044254 1.330182
H  1.044136 -4.585796 -0.959966
H  4.368096 0.515066 -0.844114
H  2.743693 4.222092 0.57522
elementType: Cl O N C H
totalener: -1322.73645227 hartree
nucrepener: 1821.26058062 hartree
electener: -3143.99703289 hartree
oneelecener: -5423.80752389 hartree
twoeener: 2279.81049101 hartree
cpcmener: -0.02478219 hartree
kineticenergy: 1318.17220169 hartree
xcener: -106.458132604361 hartree
chargesum: 0.0000000
charge: -0.105539 -0.405319 0.115405 -0.366312 -0.411434 0.377954 0.220360 -0.326912 -0.180933 -0.378706 -0.358787 -0.342684 -0.056043 0.022969 0.040337 -0.222191 -0.191712 0.071733 -0.154333 -0.159087 0.093751 0.115001 0.111301 0.148083 0.130691 0.101370 0.095153 0.102904 0.106266 0.099866 0.096011 0.091719 0.099849 0.098942 0.096229 0.112648 0.214408 0.175839 0.137081 0.137748 0.162254 0.142153 0.141966
qa: -0.1055 -0.4053 0.1154 -0.3663 -0.4114 0.3780 0.2204 -0.3269 -0.1809 -0.3787 -0.3588 -0.3427 -0.0560 0.0230 0.0403 -0.2222 -0.1917 0.0717 -0.1543 -0.1591 0.0938 0.1150 0.1113 0.1481 0.1307 0.1014 0.0952 0.1029 0.1063 0.0999 0.0960 0.0917 0.0998 0.0989 0.0962 0.1126 0.2144 0.1758 0.1371 0.1377 0.1623 0.1422 0.1420
va: 1.1997 2.0373 3.3430 2.8563 3.0302 3.6818 3.7499 3.8407 3.8754 3.9335 3.9428 3.9257 3.7255 3.5786 4.0720 4.0030 3.9783 4.0223 4.0004 4.0029 3.8210 1.0143 1.0293 0.9928 1.0064 1.0113 0.9989 1.0117 1.0040 1.0055 0.9995 1.0091 1.0154 1.0032 1.0187 1.0084 1.0266 0.9992 1.0088 1.0049 0.9944 1.0059 1.0064
dispcorr: -0.023350365 hartree
energy: -1322.759802631781
dipole: -38.62837 36.96815 -1.66022 -1.67857 2.28232 0.60375 3.49028 -3.54488 -0.05460
magnitude: 1.76744 au
magnitude: 4.49247 debye
