program: Orca
programVersion: 4.2.1
elementType: Cl O N N N C C C C C C C C C C C C C C C C H H H H H H H H H H H H H H H H H H H H H H
charge: 0
multiplicity: 1
keywords: wb97x-d3
keywords: def2-TZVPP
keywords: def2/J RIJCOSX GRIDX6 NOFINALGRIDX
keywords: grid4 nofinalgrid
keywords: scfconv7
keywords: smallprint printgap noloewdin
keywords: NOSOSCF
formula: C16H22ClN3O
InChI: InChI=1S/C16H22ClN3O/c1-15(2,3)16(21,10-20-12-18-11-19-20)9-8-13-4-6-14(17)7-5-13/h4-7,11-12,21H,8-10H2,1-3H3
43 atoms
Cl 3.904527 3.953897 0.788026
O  -0.654103 -0.560177 1.177365
N  -1.50293 -2.995558 -0.25205
N  -0.424531 -3.319881 0.468513
N  -0.593194 -4.664361 -1.310353
C  -1.622693 -0.542397 0.161257
C  -2.625775 0.596012 0.544329
C  -0.995418 -0.295567 -1.242478
C  -2.359113 -1.900866 0.149904
C  -3.69301 0.801033 -0.536341
C  -3.336862 0.279214 1.866756
C  -1.858488 1.910701 0.734495
C  0.513829 -0.53526 -1.373666
C  1.362638 0.576256 -0.815323
C  -1.585515 -3.808013 -1.310804
C  2.206996 0.384728 0.271046
C  1.333472 1.839228 -1.399493
C  0.092106 -4.322717 -0.205686
C  2.992979 1.412424 0.767506
C  2.105534 2.88257 -0.915793
C  2.933238 2.661165 0.1725
H  -1.18988 0.728759 -1.561938
H  -1.507357 -0.914838 -1.985315
H  -2.748414 -2.132548 1.141111
H  -3.196902 -1.885765 -0.545912
H  -4.358373 1.613839 -0.24107
H  -4.324703 -0.07767 -0.682058
H  -3.272673 1.073131 -1.504766
H  -2.628399 0.023164 2.653318
H  -4.060288 -0.533666 1.775817
H  -3.897583 1.153419 2.201009
H  -2.560139 2.706308 0.991816
H  -1.124782 1.840369 1.534782
H  -1.329602 2.22983 -0.164041
H  0.733448 -0.629412 -2.440954
H  0.80957 -1.488678 -0.934226
H  -0.233731 -1.430677 1.208077
H  -2.378809 -3.747463 -2.040151
H  2.258071 -0.58696 0.74551
H  0.696839 2.018703 -2.258763
H  0.99026 -4.824469 0.118102
H  3.643216 1.244079 1.614803
H  2.068317 3.856803 -1.383387
totalener: -1322.71018598 hartree
nucrepener: 1879.66786826 hartree
electener: -3202.37805424 hartree
oneelecener: -5540.96135811 hartree
twoeener: 2338.58330387 hartree
kineticenergy: 1318.18750856 hartree
xcener: -106.463360557413 hartree
chargesum: 0.0000000
charge: -0.090444 -0.377130 0.130313 -0.370132 -0.322426 0.450871 0.200111 -0.284731 -0.254979 -0.341992 -0.357474 -0.324163 -0.148724 0.162556 0.044809 -0.164122 -0.281039 0.082420 -0.121717 -0.104391 0.073754 0.087370 0.095693 0.140045 0.102001 0.098274 0.083985 0.098546 0.117417 0.078361 0.090367 0.088784 0.115797 0.079143 0.105420 0.093026 0.193624 0.142400 0.097788 0.116813 0.137787 0.117151 0.118837
qa: -0.0904 -0.3771 0.1303 -0.3701 -0.3224 0.4509 0.2001 -0.2847 -0.2550 -0.3420 -0.3575 -0.3242 -0.1487 0.1626 0.0448 -0.1641 -0.2810 0.0824 -0.1217 -0.1044 0.0738 0.0874 0.0957 0.1400 0.1020 0.0983 0.0840 0.0985 0.1174 0.0784 0.0904 0.0888 0.1158 0.0791 0.1054 0.0930 0.1936 0.1424 0.0978 0.1168 0.1378 0.1172 0.1188
va: 1.2162 2.0633 3.3058 2.8287 3.0635 3.5532 3.7891 3.8960 3.9721 3.9334 3.9236 3.9356 3.8683 3.4973 4.0676 4.0387 4.0185 4.0168 4.0311 3.9974 3.9307 1.0120 1.0060 0.9926 1.0005 1.0086 1.0066 1.0032 1.0209 0.9995 1.0096 1.0099 1.0138 1.0089 1.0064 1.0255 1.0896 1.0008 1.0184 1.0086 1.0004 1.0127 1.0114
dispcorr: -0.025371354 hartree
energy: -1322.735557335428
dipole: -31.81834 30.34126 -1.47708 -5.21324 4.89133 -0.32191 -2.19754 1.70310 -0.49444
magnitude: 1.59055 au
magnitude: 4.04286 debye
