program: Gaussian 09
title: 000030843
version: EM64L-G09RevD.01
frameworkgroup: C1[X(C23H26N2O2)]
method: RPBEPBE
basis: SDD
operation: Freq
keyword: #p
keyword: freq=noraman
keyword: PBEPBE/SDD
title: #p freq=noraman PBEPBE/SDD
converged: NO YES NO NO
title: Mulliken charges:
elementType: O O N N C C C C C C C C C C C C C C C C C C C C C C C H H H H H H H H H H H H H H H H H H H H H H H H H H
charge: -0.240778 -0.217982 -0.075822 -0.355329 -0.047597 0.156125 -0.468955 -0.462279 -0.585285 -0.408013 -0.404601 0.398581 0.115052 -0.501810 -0.482096 0.143176 -0.392948 -0.398734 0.450456 -0.249204 -0.260096 -0.240126 -0.376524 -0.450035 -0.229554 -0.221305 -0.246102 0.244332 0.222852 0.205155 0.201671 0.226141 0.232892 0.250284 0.236538 0.189600 0.175439 0.212883 0.267125 0.251797 0.220321 0.193716 0.346598 0.280020 0.235993 0.229507 0.228586 0.232280 0.261656 0.232104 0.223421 0.224109 0.226766
chargesum: 0.00000
title: Mulliken charges with hydrogens summed into heavy atoms:
elementType: O O N N C C C C C C C C C C C C C C C C C C C C C C C
charge: -0.240778 -0.217982 -0.075822 -0.008731 0.196735 0.156125 -0.040947 -0.034468 -0.102108 0.018125 -0.016279 0.398581 0.115052 0.017111 -0.068059 0.143176 -0.112928 -0.162742 0.450456 -0.019697 -0.031510 -0.007846 -0.114868 -0.217931 -0.006133 0.002804 -0.019336
polarizability: 2.98510837e+02 3.05787422e+01 2.49428058e+02 2.12387650e+01 -1.84633876e+01 2.21455813e+02
1716.lowfreq: -15.0736 -6.4451 0.0002 0.0004 0.0006 4.9811 18.2742 19.5814 24.8215
frequency: 16.8504 19.4592 24.6670 39.6690 57.0752 62.9964 66.0038 81.8450 138.1475 150.3181 153.7795 172.5188 185.7232 195.6530 233.5578 242.6323 249.1913 280.4091 293.2164 330.1369 334.1331 349.6971 365.6576 375.6065 404.5717 405.9776 433.2771 443.9194 457.5659 473.6141 477.0631 528.4481 538.7801 554.4265 585.6441 598.7214 613.9520 616.8484 619.4581 665.8992 690.1830 704.0001 709.4926 734.6248 740.3527 762.5230 775.8331 780.7512 808.9275 813.3874 817.8834 853.7224 858.7718 860.0138 880.4669 907.9420 914.6341 931.1897 939.6054 974.1367 978.9226 982.2123 986.0364 989.7893 990.0335 994.1438 997.7398 1002.8022 1017.2536 1023.7658 1025.8809 1035.1876 1046.2450 1064.0443 1077.7282 1087.1604 1105.3123 1113.4349 1119.6328 1137.3946 1145.7752 1164.0420 1169.8272 1173.0896 1176.3395 1180.6035 1192.1496 1206.2611 1207.9435 1212.3398 1224.1888 1258.5662 1273.3516 1278.8794 1294.3514 1301.7751 1303.8251 1316.2939 1322.6183 1326.2135 1328.4062 1338.3567 1343.4307 1350.4016 1360.4366 1364.6153 1375.3205 1376.3415 1380.8649 1396.2702 1434.4402 1439.9742 1445.9221 1449.8900 1460.6268 1462.6573 1470.5114 1479.9145 1480.9559 1483.4640 1491.9882 1587.0293 1594.0276 1605.5440 1611.9292 1614.2152 1644.8298 2825.6948 2836.6817 2850.9620 2978.8929 2985.5190 2986.7174 2994.4021 3002.8387 3018.9978 3020.4034 3044.4217 3055.7112 3060.9607 3070.5506 3078.8853 3111.6146 3121.5036 3124.1498 3130.7788 3135.0976 3142.9621 3146.4734 3150.1261 3160.8455 3165.3949 3476.0986
redmass: 3.9294 4.7539 5.8521 5.4797 4.8776 4.2641 3.2402 4.1734 5.6597 6.6993 4.0572 4.6797 4.3551 3.8852 4.4677 3.1448 2.3990 2.6006 3.3924 4.3569 2.4643 3.3536 2.4893 4.0205 2.8441 2.8604 2.8663 3.2227 3.0367 3.5422 3.1267 3.4357 4.3147 3.1461 4.5743 4.7658 4.7824 6.3910 4.5535 4.6061 3.9409 2.1977 1.8218 2.2196 1.7554 2.2619 2.6068 2.4781 3.8833 1.4327 1.5010 2.8350 1.2531 1.2743 2.7885 2.2180 1.5009 1.4584 1.7480 1.4929 1.8795 1.4041 1.4854 5.2922 5.7856 2.1906 1.4645 1.3572 2.0373 2.8224 2.1683 3.0777 2.0351 2.5921 1.6227 1.9092 2.3096 2.4699 2.3747 2.4524 1.8659 2.1992 1.0612 1.4030 1.0635 1.1134 1.7094 1.2029 1.7175 2.2296 1.4403 1.3692 1.6539 1.6765 1.4173 3.6185 1.3933 1.3666 1.3893 1.4394 1.3648 1.3270 1.3909 1.4781 1.4001 1.5655 2.1803 3.6573 3.0163 1.8494 2.1765 2.0845 1.0969 1.0935 1.1147 1.0935 1.1070 1.4414 1.6951 1.5158 1.2026 5.8548 6.1544 6.2449 6.9106 6.1321 6.8163 1.0709 1.0714 1.0697 1.0761 1.0790 1.0697 1.0647 1.0648 1.0650 1.0828 1.0878 1.1006 1.1015 1.0984 1.0979 1.0870 1.0861 1.0845 1.0874 1.0914 1.0917 1.0954 1.0958 1.1014 1.1015 1.0757
irintensity: 0.2304 0.0582 0.0701 0.1582 0.2034 0.1721 0.3453 1.4827 2.2801 5.6902 5.0661 0.1355 0.5262 2.1304 1.2909 4.2212 1.5840 0.6225 0.6459 4.9568 1.0576 6.0167 3.3747 14.6814 0.3462 0.0617 4.4489 7.3824 3.8759 4.6084 2.5388 14.0086 2.1326 10.1777 12.6702 6.3574 7.0980 0.0941 6.9677 4.6579 7.9408 34.0770 54.3414 30.2725 22.1842 31.5513 20.4279 12.5980 3.5033 95.0177 10.8685 3.9191 0.2063 1.9808 1.8856 4.7826 10.8589 2.6304 2.1876 10.3704 23.5518 1.2256 6.0576 3.8032 0.2001 12.0647 6.8939 0.7236 1.6601 6.6708 14.0969 6.3328 7.0261 5.8403 11.0696 11.9745 0.8863 21.8321 28.9103 3.1338 14.9878 2.9321 0.3741 1.1675 0.3162 4.0645 189.5983 20.5788 0.5121 5.6730 15.3139 1.6084 99.6584 95.4952 15.6573 69.4646 11.3273 8.9432 11.7289 1.4670 11.4295 22.0751 2.4524 3.6630 12.6006 4.2969 6.7958 1.1815 3.8286 0.8722 7.8766 12.0278 15.5589 4.1101 5.8444 8.5720 5.5134 6.5925 40.4091 8.5832 6.3008 5.2639 0.8816 77.2351 89.4518 7.3985 381.3133 52.4729 37.0987 169.6397 3.4386 24.7550 3.7837 37.0735 9.1424 12.3130 55.3545 29.6648 30.1637 35.8224 14.3183 14.4740 8.8837 0.1381 2.2981 3.2658 19.2619 13.2449 34.2221 25.4668 28.7829 25.5429 37.4415
temp: 298.150 k
press: 1.00000 atm
elementType: 8 8 7 7 6 6 6 6 6 6 6 6 6 6 6 6 6 6 6 6 6 6 6 6 6 6 6 1 1 1 1 1 1 1 1 1 1 1 1 1 1 1 1 1 1 1 1 1 1 1 1 1 1
symmnumber: 1
zpe: 1159467.1 jmol-1
zpe.correction: 0.441618 hartree
zpe.thermalcorrener: 0.465086 hartree
zpe.thermalcorrenthalpy: 0.466030 hartree
zpe.thermalcorrgfe: 0.386304 hartree
zpe.sumelectzpe: -1150.054182 hartree
zpe.sumelectthermal: -1150.030714 hartree
zpe.sumelectthermalent: -1150.029770 hartree
zpe.sumelectthermalfe: -1150.109496 hartree
dipole: 0.8911 -3.1149 -1.7835
dipole: 3.6983
quadrupole: -166.0848 -165.3133 -156.6852
quadrupole: 19.4672 7.0038 -2.6080
quadrupole: -3.3903 -2.6189 6.0092 19.4672 7.0038 -2.6080
hfenergy: -1150.4957998 hartree
pointgroup: C01 [X(C23H26N2O2)]
dipole: -0.3316398 1.330576 -0.486489 debye
polarizability: 299.0646856|32.7419389|241.0632709|-18.3468808|21.0727344|229.2667511 unknown
InChI: InChI=1S/C23H26N2O2/c26-21-11-14-23(22(27)24-21,19-9-5-2-6-10-19)20-12-15-25(16-13-20)17-18-7-3-1-4-8-18/h1-10,20,24H,11-17H2
charge 0 multiplicity 1
53 atoms
O  2.014202 -1.372754 2.156598
O  4.134422 -3.909159 -1.059425
N  -2.324368 1.042023 0.080072
N  3.026303 -2.568877 0.471423
C  0.506569 0.244709 0.329691
C  1.88293 -0.393588 -0.124915
C  -0.657298 -0.773196 0.452676
C  0.052603 1.415679 -0.575377
C  1.768437 -1.091005 -1.51015
C  -1.928201 -0.072844 0.974761
C  -1.243453 2.049935 -0.029997
C  2.97631 0.717622 -0.093239
C  2.28748 -1.45641 0.927288
C  3.040045 -1.870003 -1.903926
C  -3.623581 1.64304 0.465537
C  3.45484 -2.872909 -0.841549
C  3.474823 1.183939 1.153197
C  3.441484 1.350321 -1.275689
C  -4.808439 0.712003 0.221621
C  4.414084 2.235906 1.212928
C  4.381099 2.404248 -1.217625
C  4.875411 2.851862 0.027265
C  -4.865473 -0.084512 -0.95046
C  -5.888736 0.660234 1.135918
C  -5.982258 -0.909941 -1.204878
C  -7.01081 -0.16309 0.882693
C  -7.061635 -0.950777 -0.289934
H  0.690576 0.649106 1.346477
H  -0.389042 -1.589334 1.148242
H  -0.896356 -1.217743 -0.532386
H  -0.146813 1.051677 -1.602263
H  0.837262 2.191782 -0.635124
H  1.526989 -0.35225 -2.292869
H  0.917087 -1.794656 -1.480481
H  -2.762707 -0.794458 1.024625
H  -1.743184 0.297137 2.017862
H  -1.023359 2.524217 0.963802
H  -1.582511 2.854379 -0.710041
H  3.893949 -1.182655 -2.059244
H  2.902181 -2.42631 -2.846621
H  -3.751186 2.558497 -0.147691
H  -3.632437 1.975452 1.535664
H  3.304548 -3.239454 1.199843
H  3.127112 0.719668 2.08268
H  3.066656 1.040681 -2.257001
H  4.785578 2.573176 2.187051
H  4.722761 2.875322 -2.146241
H  5.605747 3.667134 0.073051
H  -4.015707 -0.053819 -1.641749
H  -5.851497 1.263321 2.052255
H  -6.013442 -1.521675 -2.114122
H  -7.838298 -0.194071 1.600829
H  -7.928498 -1.591878 -0.486551
