program: Orca
programVersion: 4.2.1
elementType: Cl O N N N C C C C C C C C C C C C C C C C H H H H H H H H H H H H H H H H H H H H H H
charge: 0
multiplicity: 1
keywords: wb97x-d3
keywords: def2-TZVPP
keywords: def2/J RIJCOSX GRIDX6 NOFINALGRIDX
keywords: grid4 nofinalgrid
keywords: scfconv7
keywords: smallprint printgap noloewdin
keywords: NOSOSCF
formula: C16H22ClN3O
InChI: InChI=1S/C16H22ClN3O/c1-15(2,3)16(21,10-20-12-18-11-19-20)9-8-13-4-6-14(17)7-5-13/h4-7,11-12,21H,8-10H2,1-3H3
43 atoms
Cl 4.968845 3.987193 -1.294266
O  -1.723938 -0.821645 1.65006
N  -1.650028 -3.03701 0.075758
N  -0.82454 -3.385825 1.069264
N  -2.313118 -5.012433 0.697297
C  -1.73068 -0.508504 0.284344
C  -3.141304 0.099948 -0.004676
C  -0.604807 0.492798 -0.047386
C  -1.466361 -1.776837 -0.598966
C  -4.228577 -0.97165 0.133997
C  -3.460562 1.211297 1.004268
C  -3.215407 0.696866 -1.413134
C  0.738486 0.147883 0.601612
C  1.817228 1.088109 0.145432
C  -2.530615 -4.021739 -0.131684
C  2.595184 0.803933 -0.97191
C  2.037283 2.293037 0.805058
C  -1.261548 -4.575079 1.413021
C  3.564273 1.686473 -1.421751
C  3.000282 3.189517 0.370676
C  3.760493 2.879094 -0.745016
H  -0.883881 1.498116 0.274097
H  -0.473846 0.554474 -1.132522
H  -2.105588 -1.779338 -1.480334
H  -0.439852 -1.76892 -0.96806
H  -5.214593 -0.506543 0.085114
H  -4.159016 -1.499895 1.08409
H  -4.200227 -1.706855 -0.672531
H  -4.434997 1.644116 0.770647
H  -2.73776 2.027084 0.975492
H  -3.501116 0.834949 2.024208
H  -2.553129 1.553716 -1.537647
H  -2.973427 -0.024401 -2.197326
H  -4.230097 1.04477 -1.612864
H  1.032525 -0.881755 0.374156
H  0.638702 0.204939 1.686668
H  -1.083018 -1.520859 1.834414
H  -3.299773 -3.979475 -0.886875
H  2.449589 -0.129917 -1.502423
H  1.449086 2.537245 1.681797
H  -0.803914 -5.142933 2.207506
H  4.165199 1.447456 -2.288251
H  3.161734 4.119559 0.897996
totalener: -1322.71117423 hartree
nucrepener: 1803.71027466 hartree
electener: -3126.42144890 hartree
oneelecener: -5388.66917809 hartree
twoeener: 2262.24772919 hartree
kineticenergy: 1318.18840688 hartree
xcener: -106.460808143370 hartree
chargesum: -0.0000000
charge: -0.084991 -0.374769 0.153114 -0.353251 -0.332694 0.432852 0.227038 -0.309302 -0.313000 -0.357713 -0.322492 -0.347381 -0.101976 0.059188 0.062907 -0.202468 -0.190768 0.082604 -0.128387 -0.133016 0.084203 0.100340 0.098490 0.122103 0.143784 0.096121 0.123050 0.061779 0.087387 0.083209 0.111967 0.099209 0.085675 0.097502 0.103061 0.097639 0.193151 0.139759 0.111125 0.118106 0.136885 0.119342 0.120616
qa: -0.0850 -0.3748 0.1531 -0.3533 -0.3327 0.4329 0.2270 -0.3093 -0.3130 -0.3577 -0.3225 -0.3474 -0.1020 0.0592 0.0629 -0.2025 -0.1908 0.0826 -0.1284 -0.1330 0.0842 0.1003 0.0985 0.1221 0.1438 0.0961 0.1230 0.0618 0.0874 0.0832 0.1120 0.0992 0.0857 0.0975 0.1031 0.0976 0.1932 0.1398 0.1111 0.1181 0.1369 0.1193 0.1206
va: 1.2214 2.0637 3.2728 2.8571 3.0689 3.5490 3.7213 3.9032 3.9199 3.9260 3.9349 3.9499 3.7349 3.6096 4.0681 4.0195 4.0169 4.0370 4.0167 4.0167 3.9229 1.0153 1.0062 1.0033 0.9967 1.0146 1.0137 1.0031 1.0046 1.0092 1.0171 1.0015 1.0079 1.0088 1.0122 1.0348 1.0858 1.0004 1.0123 1.0100 0.9991 1.0127 1.0122
dispcorr: -0.022895043 hartree
energy: -1322.734069276847
dipole: -35.14664 34.58189 -0.56475 -6.77266 6.92528 0.15261 1.47467 -2.17071 -0.69604
magnitude: 0.90924 au
magnitude: 2.31109 debye
