program: Orca
programVersion: 4.2.1
elementType: Si F O N N N C C C C C C C C C C C C C C H H H H H H H H H H H H H H H H H H H H
charge: 0
multiplicity: 1
keywords: wb97x-d3
keywords: def2-TZVPP
keywords: def2/J RIJCOSX GRIDX6 NOFINALGRIDX
keywords: grid4 nofinalgrid
keywords: scfconv7
keywords: smallprint printgap noloewdin
keywords: NOSOSCF
formula: C14H20FN3OSi
InChI: InChI=1S/C14H20FN3OSi/c1-20(2,3)9-14(19,8-18-11-16-10-17-18)12-4-6-13(15)7-5-12/h4-7,10-11,19H,8-9H2,1-3H3
40 atoms
Si -3.107167 -0.191545 -0.039629
F  1.970423 -3.950536 0.220647
O  -0.678093 1.710167 1.086332
N  1.771828 2.084029 -0.546491
N  2.042224 2.478684 0.703165
N  3.879454 1.6334 -0.258324
C  -1.841249 0.986428 -0.836652
C  -0.470004 1.117451 -0.175815
C  0.413067 2.044889 -1.037346
C  -4.766115 0.262557 -0.812707
C  -3.235262 -0.017514 1.829205
C  -2.715364 -1.986545 -0.461753
C  0.204536 -0.243634 -0.054034
C  0.520524 -0.973964 -1.199266
C  0.508036 -0.796718 1.183742
C  1.114526 -2.222304 -1.118893
C  1.10186 -2.04863 1.287089
C  2.868423 1.567112 -1.093955
C  1.394193 -2.739519 0.131173
C  3.314361 2.191374 0.82464
H  -2.291198 1.983162 -0.908319
H  -1.717507 0.648332 -1.870624
H  -0.002103 3.053451 -1.03967
H  0.453594 1.703904 -2.069703
H  -5.062036 1.282202 -0.556599
H  -5.561093 -0.402836 -0.469286
H  -4.736084 0.197029 -1.902513
H  -3.427559 1.011114 2.137154
H  -2.32783 -0.350319 2.333931
H  -4.05971 -0.629165 2.203593
H  -3.543157 -2.636114 -0.166617
H  -1.820414 -2.347069 0.047797
H  -2.560157 -2.124394 -1.533504
H  0.177742 2.013175 1.427489
H  0.296032 -0.580381 -2.183223
H  0.274837 -0.263589 2.094437
H  1.352893 -2.782431 -2.013353
H  1.332118 -2.472406 2.255762
H  2.892116 1.175032 -2.098101
H  3.85515 2.401289 1.73387
elementType: Si F O N C H
totalener: -1174.49007504 hartree
nucrepener: 1790.96847407 hartree
electener: -2965.45854910 hartree
oneelecener: -5166.58583796 hartree
twoeener: 2201.12728886 hartree
cpcmener: -0.02999605 hartree
kineticenergy: 1170.06520873 hartree
xcener: -100.448503915488 hartree
chargesum: -0.0000000
charge: 0.457829 -0.227730 -0.442939 0.130647 -0.385310 -0.410503 -0.308598 0.599248 -0.160820 -0.463735 -0.411091 -0.415855 -0.063524 -0.295874 -0.210279 -0.173425 -0.203685 0.073543 0.298982 0.080555 0.099695 0.099547 0.134726 0.123116 0.101190 0.099625 0.102371 0.100182 0.101924 0.108934 0.115507 0.092950 0.103146 0.221884 0.138142 0.138749 0.155012 0.153527 0.178035 0.164304
qa: 0.4578 -0.2277 -0.4429 0.1306 -0.3853 -0.4105 -0.3086 0.5992 -0.1608 -0.4637 -0.4111 -0.4159 -0.0635 -0.2959 -0.2103 -0.1734 -0.2037 0.0735 0.2990 0.0806 0.0997 0.0995 0.1347 0.1231 0.1012 0.0996 0.1024 0.1002 0.1019 0.1089 0.1155 0.0930 0.1031 0.2219 0.1381 0.1387 0.1550 0.1535 0.1780 0.1643
va: 4.1013 1.0485 2.0022 3.3240 2.8615 3.0224 3.8467 3.5367 3.9225 3.9193 3.8899 3.8822 3.4553 3.9295 3.8963 3.8908 3.9216 4.0419 3.9130 4.0201 1.0222 1.0122 1.0096 0.9997 1.0105 1.0107 1.0085 1.0129 1.0120 1.0097 1.0097 1.0146 1.0082 1.0548 1.0113 1.0317 0.9952 0.9978 0.9923 0.9933
dispcorr: -0.022953123 hartree
energy: -1174.513028160232
dipole: -26.53381 25.67574 -0.85807 4.54011 -4.11523 0.42487 -2.48373 0.91582 -1.56790
magnitude: 1.83715 au
magnitude: 4.66967 debye
