program: Orca
programVersion: 4.2.1
elementType: Si F O N N N C C C C C C C C C C C C C C H H H H H H H H H H H H H H H H H H H H
charge: 0
multiplicity: 1
keywords: wb97x-d3
keywords: def2-TZVPP
keywords: def2/J RIJCOSX GRIDX6 NOFINALGRIDX
keywords: grid4 nofinalgrid
keywords: scfconv7
keywords: smallprint printgap noloewdin
keywords: NOSOSCF
formula: C14H20FN3OSi
InChI: InChI=1S/C14H20FN3OSi/c1-20(2,3)9-14(19,8-18-11-16-10-17-18)12-4-6-13(15)7-5-12/h4-7,10-11,19H,8-9H2,1-3H3
40 atoms
Si -3.239795 0.040568 0.150002
F  2.185423 -3.938466 -0.519153
O  -0.608258 1.301926 1.321218
N  1.775199 2.012108 -0.251452
N  2.738377 1.398344 -0.945588
N  3.504892 2.022801 1.068577
C  -1.85834 1.017539 -0.723249
C  -0.484069 0.997723 -0.052956
C  0.413284 2.059886 -0.726145
C  -3.904456 1.009828 1.624747
C  -2.69168 -1.669736 0.712294
C  -4.626037 -0.141089 -1.11492
C  0.201401 -0.351323 -0.154768
C  0.839492 -0.925937 0.939424
C  0.267482 -1.011375 -1.37875
C  1.510304 -2.135928 0.825594
C  0.930419 -2.220809 -1.513321
C  2.243897 2.364303 0.946357
C  1.540716 -2.764427 -0.400795
C  3.748991 1.434529 -0.11716
H  -2.20095 2.058364 -0.796708
H  -1.786301 0.677018 -1.759102
H  0.006475 3.055232 -0.538662
H  0.43755 1.915738 -1.804163
H  -4.827518 0.559935 1.997498
H  -4.135639 2.04213 1.352845
H  -3.201203 1.037801 2.458113
H  -3.547767 -2.229235 1.097347
H  -1.947713 -1.621462 1.507888
H  -2.259383 -2.251726 -0.103581
H  -5.494266 -0.643955 -0.683583
H  -4.307011 -0.726974 -1.979583
H  -4.963909 0.829046 -1.485861
H  -1.128656 2.108545 1.406272
H  0.822306 -0.441925 1.904964
H  -0.196925 -0.586326 -2.259302
H  1.999518 -2.578379 1.683603
H  0.972659 -2.72669 -2.46892
H  1.652697 2.882888 1.683083
H  4.710263 1.023858 -0.384735
elementType: Si F O N C H
totalener: -1174.48765639 hartree
nucrepener: 1782.31943561 hartree
electener: -2956.80709200 hartree
oneelecener: -5149.44473543 hartree
twoeener: 2192.63764343 hartree
cpcmener: -0.03541904 hartree
kineticenergy: 1170.06353401 hartree
xcener: -100.444340519150 hartree
chargesum: 0.0000000
charge: 0.462122 -0.229155 -0.412450 0.120336 -0.340098 -0.415212 -0.362363 0.551472 -0.147616 -0.438232 -0.429617 -0.440472 -0.004656 -0.234847 -0.241452 -0.202137 -0.202862 0.056486 0.299885 0.048153 0.113972 0.102338 0.138756 0.123995 0.105816 0.108308 0.100628 0.117859 0.104712 0.105792 0.100605 0.103231 0.103174 0.219359 0.141639 0.139806 0.152907 0.153710 0.164180 0.161929
qa: 0.4621 -0.2292 -0.4125 0.1203 -0.3401 -0.4152 -0.3624 0.5515 -0.1476 -0.4382 -0.4296 -0.4405 -0.0047 -0.2348 -0.2415 -0.2021 -0.2029 0.0565 0.2999 0.0482 0.1140 0.1023 0.1388 0.1240 0.1058 0.1083 0.1006 0.1179 0.1047 0.1058 0.1006 0.1032 0.1032 0.2194 0.1416 0.1398 0.1529 0.1537 0.1642 0.1619
va: 4.1137 1.0458 2.0113 3.3646 2.8888 3.0278 3.8958 3.5968 3.9246 3.8730 3.9037 3.9027 3.4219 3.8822 3.9252 3.9077 3.9065 4.0768 3.9047 4.0543 1.0063 1.0144 0.9985 1.0098 1.0093 1.0048 1.0152 1.0079 1.0090 1.0075 1.0095 1.0073 1.0071 1.0095 1.0346 1.0074 0.9967 0.9962 1.0120 0.9962
dispcorr: -0.022694318 hartree
energy: -1174.510350705929
dipole: -29.44639 26.88127 -2.56513 7.83307 -6.28848 1.54458 1.21252 -1.80235 -0.58983
magnitude: 3.05180 au
magnitude: 7.75707 debye
