program: Orca
programVersion: 4.2.1
elementType: Si F O N N N C C C C C C C C C C C C C C H H H H H H H H H H H H H H H H H H H H
charge: 0
multiplicity: 1
keywords: wb97x-d3
keywords: def2-TZVPP
keywords: def2/J RIJCOSX GRIDX6 NOFINALGRIDX
keywords: grid4 nofinalgrid
keywords: scfconv7
keywords: smallprint printgap noloewdin
keywords: NOSOSCF
formula: C14H20FN3OSi
InChI: InChI=1S/C14H20FN3OSi/c1-20(2,3)9-14(19,8-18-11-16-10-17-18)12-4-6-13(15)7-5-12/h4-7,10-11,19H,8-9H2,1-3H3
40 atoms
Si -3.192415 -0.164658 -0.090754
F  2.259199 -3.83596 0.564763
O  -0.782228 1.679432 0.921743
N  1.730672 2.034343 -0.63982
N  1.942152 2.533667 0.583784
N  3.826348 1.631575 -0.223077
C  -1.819919 0.785236 -1.001619
C  -0.490724 1.014503 -0.286891
C  0.393733 1.92083 -1.172526
C  -4.589415 -0.301338 -1.351685
C  -3.835903 0.753528 1.421193
C  -2.656916 -1.900403 0.409135
C  0.24616 -0.297183 -0.041386
C  0.580706 -1.124885 -1.112159
C  0.623885 -0.691557 1.236391
C  1.257476 -2.318321 -0.920562
C  1.303185 -1.883831 1.451262
C  2.854214 1.483925 -1.093163
C  1.605626 -2.67816 0.366529
C  3.209541 2.271435 0.784524
H  -2.236566 1.757117 -1.292987
H  -1.642963 0.25507 -1.942108
H  -0.053061 2.912874 -1.248094
H  0.478442 1.520257 -2.180709
H  -5.455584 -0.820739 -0.936327
H  -4.275775 -0.852206 -2.24116
H  -4.928286 0.682974 -1.682362
H  -4.718375 0.251115 1.824031
H  -4.128365 1.776791 1.17698
H  -3.094275 0.803501 2.217921
H  -3.52217 -2.479106 0.742331
H  -1.934928 -1.893112 1.226424
H  -2.202386 -2.442694 -0.42217
H  0.038104 2.062464 1.269302
H  0.312898 -0.850017 -2.125119
H  0.377344 -0.082085 2.094245
H  1.509025 -2.954435 -1.758893
H  1.58724 -2.1863 2.450725
H  2.92534 1.009255 -2.058766
H  3.709404 2.56232 1.694875
elementType: Si F O N C H
totalener: -1174.48984536 hartree
nucrepener: 1785.27376339 hartree
electener: -2959.76360874 hartree
oneelecener: -5155.22427166 hartree
twoeener: 2195.46066292 hartree
cpcmener: -0.02941635 hartree
kineticenergy: 1170.06203382 hartree
xcener: -100.447141064839 hartree
chargesum: -0.0000000
charge: 0.457276 -0.228091 -0.436979 0.129131 -0.386028 -0.408172 -0.314693 0.600262 -0.150991 -0.446395 -0.421347 -0.435336 -0.052717 -0.288431 -0.240035 -0.172416 -0.183472 0.071371 0.287976 0.076601 0.102328 0.101154 0.132906 0.123512 0.100313 0.102610 0.102311 0.105580 0.102259 0.097019 0.117371 0.108294 0.103512 0.219958 0.137090 0.134395 0.155064 0.154221 0.178329 0.164259
qa: 0.4573 -0.2281 -0.4370 0.1291 -0.3860 -0.4082 -0.3147 0.6003 -0.1510 -0.4464 -0.4213 -0.4353 -0.0527 -0.2884 -0.2400 -0.1724 -0.1835 0.0714 0.2880 0.0766 0.1023 0.1012 0.1329 0.1235 0.1003 0.1026 0.1023 0.1056 0.1023 0.0970 0.1174 0.1083 0.1035 0.2200 0.1371 0.1344 0.1551 0.1542 0.1783 0.1643
va: 4.1234 1.0475 2.0102 3.3228 2.8586 3.0216 3.8477 3.5697 3.9110 3.9081 3.8791 3.8989 3.4467 3.9448 3.8898 3.8837 3.8923 4.0435 3.9225 4.0241 1.0164 1.0113 1.0117 0.9985 1.0098 1.0076 1.0076 1.0083 1.0087 1.0186 1.0081 1.0069 1.0082 1.0546 1.0106 1.0362 0.9948 0.9959 0.9919 0.9938
dispcorr: -0.022657043 hartree
energy: -1174.512502401903
dipole: -27.60194 26.75761 -0.84433 4.49330 -4.18318 0.31012 -3.50385 1.90676 -1.59709
magnitude: 1.83297 au
magnitude: 4.65903 debye
