program: Orca
programVersion: 4.2.1
elementType: Si F O N N N C C C C C C C C C C C C C C H H H H H H H H H H H H H H H H H H H H
charge: 0
multiplicity: 1
keywords: wb97x-d3
keywords: def2-TZVPP
keywords: def2/J RIJCOSX GRIDX6 NOFINALGRIDX
keywords: grid4 nofinalgrid
keywords: scfconv7
keywords: smallprint printgap noloewdin
keywords: NOSOSCF
formula: C14H20FN3OSi
InChI: InChI=1S/C14H20FN3OSi/c1-20(2,3)9-14(19,8-18-11-16-10-17-18)12-4-6-13(15)7-5-12/h4-7,10-11,19H,8-9H2,1-3H3
40 atoms
Si -3.439285 0.779846 -0.256079
F  3.244451 -4.01167 0.185646
O  -0.710924 0.696799 1.548792
N  1.250767 1.66379 -0.484932
N  1.638969 2.080144 0.723325
N  3.390287 1.973987 -0.657993
C  -1.932871 -0.383744 -0.153397
C  -0.562211 0.158624 0.257735
C  -0.118862 1.26829 -0.71772
C  -3.384967 1.842112 -1.815793
C  -3.64249 1.895456 1.244527
C  -4.930146 -0.367849 -0.376343
C  0.469983 -0.968854 0.246921
C  0.861401 -1.561158 -0.953551
C  1.035876 -1.44176 1.425369
C  1.794316 -2.584879 -0.986408
C  1.970227 -2.469849 1.415207
C  2.305907 1.594411 -1.294745
C  2.337147 -3.021053 0.206539
C  2.92897 2.254251 0.572972
H  -1.852703 -0.887559 -1.122284
H  -2.197366 -1.177413 0.554628
H  -0.757809 2.144074 -0.594668
H  -0.197083 0.950029 -1.755992
H  -3.154935 1.249069 -2.704026
H  -2.652243 2.649612 -1.76277
H  -4.357453 2.311299 -1.986427
H  -3.654108 1.329892 2.177948
H  -4.589833 2.437534 1.180735
H  -2.847678 2.63847 1.321572
H  -5.030984 -0.993245 0.513736
H  -4.859976 -1.037581 -1.236597
H  -5.859405 0.196939 -0.481353
H  0.079195 1.219134 1.758101
H  0.436487 -1.233632 -1.894756
H  0.750077 -1.017886 2.377983
H  2.092392 -3.033909 -1.924886
H  2.404197 -2.830574 2.338836
H  2.237517 1.276406 -2.323177
H  3.555645 2.598104 1.38101
elementType: Si F O N C H
totalener: -1174.49691402 hartree
nucrepener: 1751.02158437 hartree
electener: -2925.51849838 hartree
oneelecener: -5086.55590202 hartree
twoeener: 2161.03740363 hartree
cpcmener: -0.02559907 hartree
kineticenergy: 1170.02762785 hartree
xcener: -100.439604014225 hartree
chargesum: 0.0000000
charge: 0.424769 -0.225722 -0.424683 0.130342 -0.379846 -0.407226 -0.305256 0.564189 -0.229844 -0.415067 -0.396887 -0.442562 0.009037 -0.275257 -0.214626 -0.189063 -0.192577 0.072223 0.284044 0.079669 0.104465 0.099797 0.146932 0.125907 0.103968 0.098797 0.111639 0.099999 0.106134 0.092741 0.101882 0.100194 0.099358 0.221258 0.140509 0.138236 0.151775 0.150505 0.176457 0.163789
qa: 0.4248 -0.2257 -0.4247 0.1303 -0.3798 -0.4072 -0.3053 0.5642 -0.2298 -0.4151 -0.3969 -0.4426 0.0090 -0.2753 -0.2146 -0.1891 -0.1926 0.0722 0.2840 0.0797 0.1045 0.0998 0.1469 0.1259 0.1040 0.0988 0.1116 0.1000 0.1061 0.0927 0.1019 0.1002 0.0994 0.2213 0.1405 0.1382 0.1518 0.1505 0.1765 0.1638
va: 4.1403 1.0511 2.0161 3.3511 2.8665 3.0299 3.8508 3.5779 3.9590 3.8705 3.8868 3.9115 3.5182 3.9539 3.9541 3.9157 3.9009 4.0412 3.9272 4.0215 1.0112 1.0175 0.9909 0.9981 1.0084 1.0120 1.0071 1.0121 1.0088 1.0195 1.0096 1.0092 1.0102 1.0528 1.0046 1.0365 0.9973 0.9989 0.9924 0.9929
dispcorr: -0.021117354 hartree
energy: -1174.518031373485
dipole: -31.39030 30.15227 -1.23803 11.94070 -11.68926 0.25144 -4.05252 2.80139 -1.25113
magnitude: 1.77800 au
magnitude: 4.51931 debye
