program: Orca
programVersion: 4.2.1
elementType: Si F O N N N C C C C C C C C C C C C C C H H H H H H H H H H H H H H H H H H H H
charge: 0
multiplicity: 1
keywords: wb97x-d3
keywords: def2-TZVPP
keywords: def2/J RIJCOSX GRIDX6 NOFINALGRIDX
keywords: grid4 nofinalgrid
keywords: scfconv7
keywords: smallprint printgap noloewdin
keywords: NOSOSCF
formula: C14H20FN3OSi
InChI: InChI=1S/C14H20FN3OSi/c1-20(2,3)9-14(19,8-18-11-16-10-17-18)12-4-6-13(15)7-5-12/h4-7,10-11,19H,8-9H2,1-3H3
40 atoms
Si -3.241705 -0.001687 0.032224
F  2.302858 -3.955725 0.153282
O  -0.745453 1.502929 1.029218
N  1.752162 1.985915 -0.514811
N  1.956483 2.375408 0.746848
N  3.880236 1.724759 -0.182373
C  -1.816993 0.795284 -0.946794
C  -0.474897 0.943294 -0.233843
C  0.412739 1.908245 -1.051012
C  -2.729792 -1.559794 0.954909
C  -4.535908 -0.465912 -1.260962
C  -4.027188 1.22079 1.229263
C  0.250329 -0.39475 -0.112751
C  0.530048 -1.150262 -1.250458
C  0.688429 -0.876004 1.115333
C  1.21792 -2.350892 -1.173594
C  1.379675 -2.076097 1.215683
C  2.905278 1.593021 -1.053067
C  1.632789 -2.794091 0.066709
C  3.246487 2.202572 0.902165
H  -2.166778 1.786591 -1.261346
H  -1.686521 0.23008 -1.873213
H  -0.030396 2.905796 -1.052248
H  0.493019 1.5800 -2.085789
H  -3.614595 -2.064293 1.352766
H  -2.072088 -1.347217 1.798151
H  -2.214227 -2.272575 0.308549
H  -5.433228 -0.881785 -0.796423
H  -4.16063 -1.213391 -1.963855
H  -4.850386 0.400537 -1.847847
H  -4.904718 0.780995 1.711157
H  -4.362563 2.123798 0.713802
H  -3.339803 1.530237 2.017768
H  0.075049 1.870348 1.394774
H  0.213644 -0.811467 -2.229782
H  0.487531 -0.326954 2.024437
H  1.428221 -2.92799 -2.064597
H  1.714394 -2.441507 2.177929
H  2.986657 1.229006 -2.065045
H  3.744649 2.434497 1.830602
elementType: Si F O N C H
totalener: -1174.49876985 hartree
nucrepener: 1776.93712423 hartree
electener: -2951.43589408 hartree
oneelecener: -5138.58818027 hartree
twoeener: 2187.15228619 hartree
cpcmener: -0.02465608 hartree
kineticenergy: 1170.03223777 hartree
xcener: -100.441356444978 hartree
chargesum: -0.0000000
charge: 0.453864 -0.225730 -0.423231 0.135167 -0.386052 -0.404625 -0.319874 0.589814 -0.159583 -0.427552 -0.439553 -0.420083 -0.061423 -0.268105 -0.223347 -0.188195 -0.185237 0.074632 0.290976 0.079703 0.097751 0.106299 0.131140 0.121919 0.116384 0.106153 0.104294 0.099292 0.100916 0.100524 0.100631 0.100228 0.101629 0.215262 0.133657 0.134008 0.151144 0.150819 0.173179 0.163206
qa: 0.4539 -0.2257 -0.4232 0.1352 -0.3861 -0.4046 -0.3199 0.5898 -0.1596 -0.4276 -0.4396 -0.4201 -0.0614 -0.2681 -0.2233 -0.1882 -0.1852 0.0746 0.2910 0.0797 0.0978 0.1063 0.1311 0.1219 0.1164 0.1062 0.1043 0.0993 0.1009 0.1005 0.1006 0.1002 0.1016 0.2153 0.1337 0.1340 0.1511 0.1508 0.1732 0.1632
va: 4.1372 1.0516 2.0216 3.3186 2.8578 3.0274 3.8323 3.5470 3.9307 3.9035 3.9022 3.8718 3.4630 3.9738 3.8779 3.9070 3.9075 4.0400 3.9296 4.0209 1.0141 1.0099 1.0100 0.9968 1.0077 1.0086 1.0060 1.0102 1.0078 1.0081 1.0085 1.0082 1.0200 1.0643 1.0099 1.0368 0.9971 0.9974 0.9937 0.9935
dispcorr: -0.022185905 hartree
energy: -1174.520955751257
dipole: -28.09884 27.29444 -0.80440 6.10871 -5.64016 0.46855 -1.91168 0.49557 -1.41611
magnitude: 1.69469 au
magnitude: 4.30756 debye
