program: Orca
programVersion: 4.2.1
elementType: Si F O N N N C C C C C C C C C C C C C C H H H H H H H H H H H H H H H H H H H H
charge: 0
multiplicity: 1
keywords: wb97x-d3
keywords: def2-TZVPP
keywords: def2/J RIJCOSX GRIDX6 NOFINALGRIDX
keywords: grid4 nofinalgrid
keywords: scfconv7
keywords: smallprint printgap noloewdin
keywords: NOSOSCF
formula: C14H20FN3OSi
InChI: InChI=1S/C14H20FN3OSi/c1-20(2,3)9-14(19,8-18-11-16-10-17-18)12-4-6-13(15)7-5-12/h4-7,10-11,19H,8-9H2,1-3H3
40 atoms
Si -2.469477 0.34235 -0.152323
F  0.693058 -5.24573 -0.203721
O  0.295081 0.6675 1.668312
N  1.909234 2.312124 -0.207755
N  1.642199 3.03099 0.887313
N  2.106553 4.386979 -0.828527
C  -0.695476 0.970795 -0.509707
C  0.449188 0.358819 0.309145
C  1.825798 0.870193 -0.185009
C  -3.580865 1.866867 -0.217381
C  -2.683248 -0.507898 1.510778
C  -3.000755 -0.847049 -1.518661
C  0.497547 -1.155229 0.18028
C  0.406347 -1.763685 -1.068831
C  0.672157 -1.967443 1.29638
C  0.472415 -3.140403 -1.210901
C  0.737143 -3.347489 1.173792
C  2.178287 3.139285 -1.223027
C  0.635014 -3.915471 -0.079639
C  1.771406 4.269017 0.468063
H  -0.700181 2.05344 -0.344096
H  -0.512824 0.851385 -1.583531
H  2.022489 0.52052 -1.198208
H  2.611075 0.474139 0.462622
H  -3.493245 2.392224 -1.170224
H  -3.326016 2.578201 0.57034
H  -4.631947 1.603334 -0.089061
H  -3.737638 -0.746045 1.666277
H  -2.354102 0.116549 2.339644
H  -2.125254 -1.442445 1.562968
H  -2.425452 -1.773478 -1.497566
H  -2.884572 -0.406759 -2.510927
H  -4.052687 -1.11717 -1.408554
H  0.543789 1.594787 1.799135
H  0.26952 -1.163972 -1.960248
H  0.744806 -1.522253 2.277614
H  0.39394 -3.604851 -2.184552
H  0.863321 -3.975279 2.045692
H  2.423747 2.793768 -2.215533
H  1.619841 5.111701 1.123921
totalener: -1174.47530227 hartree
nucrepener: 1753.80302176 hartree
electener: -2928.27832403 hartree
oneelecener: -5091.97672155 hartree
twoeener: 2163.69839752 hartree
kineticenergy: 1170.03626055 hartree
xcener: -100.439615481339 hartree
chargesum: -0.0000000
charge: 0.448895 -0.202243 -0.393005 0.110054 -0.350327 -0.328353 -0.403343 0.584843 -0.180486 -0.412682 -0.384720 -0.391366 0.036447 -0.308547 -0.240199 -0.161178 -0.133160 0.060498 0.266719 0.081284 0.108917 0.081825 0.099930 0.134563 0.092388 0.095924 0.090062 0.100348 0.104698 0.104814 0.100146 0.089655 0.099389 0.200565 0.128678 0.137346 0.128547 0.127711 0.138500 0.136863
qa: 0.4489 -0.2022 -0.3930 0.1101 -0.3503 -0.3284 -0.4033 0.5848 -0.1805 -0.4127 -0.3847 -0.3914 0.0364 -0.3085 -0.2402 -0.1612 -0.1332 0.0605 0.2667 0.0813 0.1089 0.0818 0.0999 0.1346 0.0924 0.0959 0.0901 0.1003 0.1047 0.1048 0.1001 0.0897 0.0994 0.2006 0.1287 0.1373 0.1285 0.1277 0.1385 0.1369
va: 4.1380 1.0869 2.0310 3.3208 2.8591 3.0600 3.8907 3.4930 3.9456 3.9052 3.8992 3.8815 3.3734 3.9796 4.0127 3.9309 3.8746 4.0639 4.0046 4.0274 1.0086 1.0141 1.0003 1.0038 1.0114 1.0108 1.0157 1.0128 1.0224 1.0074 1.0116 1.0130 1.0158 1.0864 1.0043 1.0411 1.0048 1.0057 1.0015 1.0000
dispcorr: -0.021564893 hartree
energy: -1174.496867163415
dipole: -18.36743 18.54234 0.17491 9.02218 -9.11065 -0.08847 -2.02368 1.49474 -0.52894
magnitude: 0.56410 au
magnitude: 1.43382 debye
