program: Orca
programVersion: 4.2.1
elementType: Cl Cl O O N N N C C C C C C C C C C C C C C C H H H H H H H H H H H H H H H H H
charge: 0
multiplicity: 1
keywords: wb97x-d3
keywords: def2-TZVPP
keywords: def2/J RIJCOSX GRIDX6 NOFINALGRIDX
keywords: grid4 nofinalgrid
keywords: scfconv7
keywords: smallprint printgap noloewdin
keywords: NOSOSCF
formula: C15H17Cl2N3O2
InChI: InChI=1S/C15H17Cl2N3O2/c1-2-3-12-7-21-15(22-12,8-20-10-18-9-19-20)13-5-4-11(16)6-14(13)17/h4-6,9-10,12H,2-3,7-8H2,1H3
39 atoms
Cl 1.730507 2.260192 1.186872
Cl 5.652805 -0.968503 -0.416491
O  -1.002434 -0.930162 -0.470818
O  -0.662437 0.55635 1.179711
N  -2.01969 1.567318 -1.173773
N  -2.59292 2.440446 -0.342131
N  -4.143396 1.408003 -1.586557
C  -0.270639 0.201676 -0.115693
C  -1.59731 -1.497201 0.693312
C  -1.723968 -0.281935 1.596854
C  -2.908353 -2.158573 0.327712
C  -0.608057 1.29959 -1.138475
C  1.229557 -0.074328 -0.149673
C  -3.604247 -2.780907 1.532967
C  2.179588 0.787156 0.397095
C  1.699869 -1.214492 -0.793775
C  -4.925729 -3.431535 1.154863
C  3.538307 0.518762 0.321701
C  3.05018 -1.507127 -0.883222
C  -2.95555 0.953913 -1.904005
C  3.96106 -0.632419 -0.318777
C  -3.863773 2.313409 -0.626587
H  -0.913262 -2.233997 1.135223
H  -2.690939 0.220547 1.471906
H  -1.592814 -0.517808 2.653249
H  -2.723876 -2.932325 -0.423342
H  -3.567695 -1.416584 -0.134913
H  -0.289355 0.977762 -2.130369
H  -0.086791 2.226183 -0.908014
H  -3.786927 -2.018468 2.296548
H  -2.94688 -3.523965 1.99381
H  0.994204 -1.900024 -1.24125
H  -5.618852 -2.702861 0.730108
H  -4.784022 -4.220994 0.414215
H  -5.411542 -3.878859 2.022861
H  4.253231 1.203197 0.756939
H  3.379845 -2.403985 -1.388693
H  -2.726412 0.204698 -2.645328
H  -4.620202 2.900027 -0.128411
elementType: Cl O N C H
totalener: -1817.04525644 hartree
nucrepener: 2149.47863359 hartree
electener: -3966.52389003 hartree
oneelecener: -6764.37887394 hartree
twoeener: 2797.85498391 hartree
cpcmener: -0.02414180 hartree
kineticenergy: 1811.90561034 hartree
xcener: -128.814217717184 hartree
chargesum: -0.0000000
charge: -0.071266 -0.082570 -0.405199 -0.364512 0.135043 -0.355509 -0.407480 0.573736 0.186265 -0.024996 -0.175150 -0.111738 -0.059900 -0.083267 -0.058341 -0.141429 -0.283198 -0.140845 -0.179365 0.036696 0.110127 0.061459 0.089235 0.083230 0.110572 0.079874 0.069913 0.134608 0.134974 0.066062 0.067236 0.151229 0.081211 0.080537 0.091725 0.122194 0.145782 0.173236 0.159822
qa: -0.0713 -0.0826 -0.4052 -0.3645 0.1350 -0.3555 -0.4075 0.5737 0.1863 -0.0250 -0.1751 -0.1117 -0.0599 -0.0833 -0.0583 -0.1414 -0.2832 -0.1408 -0.1794 0.0367 0.1101 0.0615 0.0892 0.0832 0.1106 0.0799 0.0699 0.1346 0.1350 0.0661 0.0672 0.1512 0.0812 0.0805 0.0917 0.1222 0.1458 0.1732 0.1598
va: 1.2483 1.2215 1.9907 2.0056 3.3611 2.8720 2.9986 3.8638 3.8113 3.9982 3.9725 3.8174 3.6145 3.8709 4.0537 3.9291 3.9490 4.0704 4.0466 4.0629 3.8666 4.0378 1.0035 0.9892 0.9937 1.0127 1.0107 1.0068 1.0290 1.0076 1.0083 1.0233 1.0012 1.0005 1.0032 1.0248 1.0069 0.9988 0.9965
dispcorr: -0.021689133 hartree
energy: -1817.066945572460
dipole: -40.96628 41.30888 0.34260 -20.69796 18.96605 -1.73191 3.12460 -3.37371 -0.24911
magnitude: 1.78296 au
magnitude: 4.53192 debye
