program: Orca
programVersion: 4.2.1
elementType: Cl Cl O O N N N C C C C C C C C C C C C C C C H H H H H H H H H H H H H H H H H
charge: 0
multiplicity: 1
keywords: wb97x-d3
keywords: def2-TZVPP
keywords: def2/J RIJCOSX GRIDX6 NOFINALGRIDX
keywords: grid4 nofinalgrid
keywords: scfconv7
keywords: smallprint printgap noloewdin
keywords: NOSOSCF
formula: C15H17Cl2N3O2
InChI: InChI=1S/C15H17Cl2N3O2/c1-2-3-12-7-21-15(22-12,8-20-10-18-9-19-20)13-5-4-11(16)6-14(13)17/h4-6,9-10,12H,2-3,7-8H2,1H3
39 atoms
Cl 1.811574 2.001179 1.688117
Cl 4.191703 -0.897431 -2.096062
O  -1.775583 -0.588987 0.821386
O  -0.626605 0.492178 2.406423
N  -1.505203 1.778416 -0.903929
N  -0.54695 2.347069 -1.638625
N  -2.092504 1.409661 -2.958585
C  -0.824559 0.405609 1.022624
C  -1.600076 -1.550804 1.85843
C  -1.149984 -0.674622 3.022864
C  -2.893933 -2.296076 2.095378
C  -1.415646 1.733491 0.532511
C  0.473388 0.070514 0.288129
C  -3.361949 -3.15169 0.921328
C  1.675117 0.737951 0.511597
C  0.461874 -0.895195 -0.713405
C  -2.428951 -4.305718 0.583977
C  2.821614 0.444817 -0.21094
C  1.589381 -1.208174 -1.452873
C  -2.416391 1.216292 -1.703095
C  2.766262 -0.531496 -1.189561
C  -0.941679 2.105087 -2.861325
H  -0.797093 -2.247477 1.585225
H  -1.985105 -0.398329 3.67451
H  -0.382784 -1.158489 3.629856
H  -3.670038 -1.571992 2.361149
H  -2.752267 -2.931888 2.975219
H  -0.801295 2.571006 0.853925
H  -2.410221 1.860253 0.961229
H  -3.507708 -2.522931 0.03892
H  -4.348023 -3.55276 1.168436
H  -0.455932 -1.421902 -0.934931
H  -2.26453 -4.949067 1.45079
H  -2.847304 -4.926616 -0.209281
H  -1.451317 -3.965204 0.23858
H  3.741191 0.978194 -0.014412
H  1.541536 -1.966239 -2.222083
H  -3.285676 0.69696 -1.331815
H  -0.380905 2.445909 -3.717797
elementType: Cl O N C H
totalener: -1817.04349941 hartree
nucrepener: 2204.55840411 hartree
electener: -4021.60190352 hartree
oneelecener: -6874.76865439 hartree
twoeener: 2853.16675087 hartree
cpcmener: -0.02337693 hartree
kineticenergy: 1811.91521631 hartree
xcener: -128.815880223709 hartree
chargesum: 0.0000000
charge: -0.073196 -0.084355 -0.372440 -0.371987 0.113312 -0.335930 -0.404967 0.600447 0.059008 0.048703 -0.160163 -0.106971 -0.078856 -0.090669 -0.053112 -0.146465 -0.279395 -0.138370 -0.193110 0.059058 0.119283 0.060936 0.100373 0.079439 0.090385 0.074445 0.082316 0.129054 0.130959 0.064249 0.076645 0.154903 0.083641 0.094521 0.075203 0.119227 0.144021 0.169058 0.160799
qa: -0.0732 -0.0844 -0.3724 -0.3720 0.1133 -0.3359 -0.4050 0.6004 0.0590 0.0487 -0.1602 -0.1070 -0.0789 -0.0907 -0.0531 -0.1465 -0.2794 -0.1384 -0.1931 0.0591 0.1193 0.0609 0.1004 0.0794 0.0904 0.0744 0.0823 0.1291 0.1310 0.0642 0.0766 0.1549 0.0836 0.0945 0.0752 0.1192 0.1440 0.1691 0.1608
va: 1.2475 1.2195 1.9963 2.0093 3.3594 2.8794 3.0337 3.8185 3.9183 3.9768 3.9493 3.8633 3.5674 3.8546 4.0322 3.8688 3.9379 4.0884 4.0897 4.0716 3.8553 4.0427 0.9835 0.9973 0.9942 1.0210 1.0085 1.0283 1.0189 1.0156 1.0069 1.0093 1.0015 1.0036 0.9998 1.0256 1.0069 1.0026 0.9958
dispcorr: -0.022837481 hartree
energy: -1817.066336892344
dipole: -32.68134 31.42540 -1.25594 -22.96987 21.43892 -1.53095 10.29791 -8.53932 1.75859
magnitude: 2.64837 au
magnitude: 6.73161 debye
