program: Orca
programVersion: 4.2.1
elementType: Cl Cl O O N N N C C C C C C C C C C C C C C C H H H H H H H H H H H H H H H H H
charge: 0
multiplicity: 1
keywords: wb97x-d3
keywords: def2-TZVPP
keywords: def2/J RIJCOSX GRIDX6 NOFINALGRIDX
keywords: grid4 nofinalgrid
keywords: scfconv7
keywords: smallprint printgap noloewdin
keywords: NOSOSCF
formula: C15H17Cl2N3O2
InChI: InChI=1S/C15H17Cl2N3O2/c1-2-3-12-7-21-15(22-12,8-20-10-18-9-19-20)13-5-4-11(16)6-14(13)17/h4-6,9-10,12H,2-3,7-8H2,1H3
39 atoms
Cl 0.990526 -0.532512 -2.295666
Cl 5.742555 -0.425498 0.109328
O  -0.966379 -0.618579 -0.085196
O  -0.614461 0.569569 1.777645
N  -2.022861 1.923696 -0.384979
N  -2.740808 2.385634 0.640328
N  -4.078006 1.84553 -1.073272
C  -0.23797 0.441901 0.432717
C  -1.197853 -1.523868 0.986919
C  -1.367012 -0.570289 2.161866
C  -2.366444 -2.439646 0.683139
C  -0.600322 1.736235 -0.30433
C  1.268747 0.197931 0.33064
C  -3.660516 -1.75782 0.256174
C  1.888132 -0.227868 -0.844367
C  2.087737 0.428128 1.431477
C  -4.778495 -2.76543 0.034344
C  3.258835 -0.423602 -0.920933
C  3.459146 0.241237 1.383903
C  -2.832238 1.597604 -1.394885
C  4.033609 -0.186352 0.200714
C  -3.964531 2.323159 0.18196
H  -0.303447 -2.141615 1.146072
H  -2.408644 -0.282066 2.328878
H  -0.969781 -0.98602 3.089249
H  -2.540008 -3.040087 1.582323
H  -2.058493 -3.149271 -0.090234
H  -0.205404 1.731437 -1.318371
H  -0.155243 2.584238 0.214699
H  -3.497083 -1.192877 -0.662692
H  -3.977836 -1.031616 1.00848
H  1.649022 0.764246 2.3600
H  -5.002859 -3.324294 0.945186
H  -5.698484 -2.271868 -0.282022
H  -4.514837 -3.490291 -0.738674
H  3.710873 -0.756702 -1.844813
H  4.062878 0.429882 2.260509
H  -2.47238 1.198493 -2.330174
H  -4.809227 2.642101 0.772847
elementType: Cl O N C H
totalener: -1817.04353261 hartree
nucrepener: 2178.70194996 hartree
electener: -3995.74548258 hartree
oneelecener: -6822.84209420 hartree
twoeener: 2827.09661162 hartree
cpcmener: -0.02355793 hartree
kineticenergy: 1811.91822996 hartree
xcener: -128.818067580454 hartree
chargesum: 0.0000000
charge: -0.074726 -0.082802 -0.362404 -0.386998 0.152502 -0.352317 -0.406016 0.576237 0.155463 -0.017655 -0.152672 -0.130293 -0.105271 -0.065805 -0.031060 -0.137381 -0.291109 -0.153822 -0.184924 0.048976 0.119136 0.056150 0.094737 0.088713 0.105606 0.072270 0.078223 0.140433 0.134026 0.063584 0.052916 0.150362 0.081711 0.091756 0.081705 0.121645 0.144895 0.164011 0.160197
qa: -0.0747 -0.0828 -0.3624 -0.3870 0.1525 -0.3523 -0.4060 0.5762 0.1555 -0.0177 -0.1527 -0.1303 -0.1053 -0.0658 -0.0311 -0.1374 -0.2911 -0.1538 -0.1849 0.0490 0.1191 0.0562 0.0947 0.0887 0.1056 0.0723 0.0782 0.1404 0.1340 0.0636 0.0529 0.1504 0.0817 0.0918 0.0817 0.1216 0.1449 0.1640 0.1602
va: 1.2441 1.2212 2.0160 1.9815 3.3493 2.8978 3.0086 3.8683 3.8910 3.9754 3.9469 3.8201 3.5747 3.8613 4.0138 3.9514 3.9534 4.0827 4.0507 4.0666 3.8541 4.0446 0.9970 1.0016 1.0002 1.0098 1.0073 1.0162 1.0195 1.0171 1.0154 1.0257 1.0000 1.0034 0.9999 1.0260 1.0075 1.0001 0.9965
dispcorr: -0.022710907 hartree
energy: -1817.066243521522
dipole: -36.49479 37.44493 0.95014 -10.38644 9.47073 -0.91570 10.79275 -10.15957 0.63318
magnitude: 1.46363 au
magnitude: 3.72024 debye
