program: Orca
programVersion: 4.2.1
elementType: Cl Cl O O N N N C C C C C C C C C C C C C C C H H H H H H H H H H H H H H H H H
charge: 0
multiplicity: 1
keywords: wb97x-d3
keywords: def2-TZVPP
keywords: def2/J RIJCOSX GRIDX6 NOFINALGRIDX
keywords: grid4 nofinalgrid
keywords: scfconv7
keywords: smallprint printgap noloewdin
keywords: NOSOSCF
formula: C15H17Cl2N3O2
InChI: InChI=1S/C15H17Cl2N3O2/c1-2-3-12-7-21-15(22-12,8-20-10-18-9-19-20)13-5-4-11(16)6-14(13)17/h4-6,9-10,12H,2-3,7-8H2,1H3
39 atoms
Cl 1.12566 -0.323827 -2.46443
Cl 5.604592 -0.617621 0.402261
O  -1.066533 -0.476011 -0.499758
O  -0.842126 0.481267 1.517165
N  -1.964775 2.217013 -0.379189
N  -2.800283 1.882452 -1.364506
N  -3.915471 2.875448 0.304307
C  -0.341499 0.473757 0.205767
C  -1.632384 -1.396341 0.424318
C  -1.839049 -0.519032 1.6494
C  -2.903941 -1.974262 -0.16288
C  -0.571902 1.862565 -0.408702
C  1.154492 0.166392 0.230029
C  -3.672893 -2.868043 0.806978
C  1.875558 -0.186937 -0.91007
C  1.865912 0.282865 1.420948
C  -2.92561 -4.124565 1.231434
C  3.239906 -0.434746 -0.864508
C  3.228287 0.047963 1.493226
C  -2.643892 2.801844 0.612379
C  3.904791 -0.315066 0.342591
C  -3.955186 2.299817 -0.914823
H  -0.907991 -2.192062 0.642702
H  -2.835304 -0.061862 1.660023
H  -1.69354 -1.05125 2.590223
H  -2.65718 -2.54346 -1.063759
H  -3.542959 -1.144128 -0.478203
H  -0.224973 1.904882 -1.438918
H  -0.010879 2.602836 0.161295
H  -4.610047 -3.156876 0.325619
H  -3.962929 -2.295281 1.693406
H  1.346604 0.565389 2.325274
H  -2.033541 -3.902256 1.819626
H  -3.560528 -4.764391 1.845964
H  -2.611021 -4.710459 0.365415
H  3.772616 -0.714329 -1.762822
H  3.747909 0.149258 2.435825
H  -2.174691 3.15993 1.515112
H  -4.862979 2.188558 -1.4875
elementType: Cl O N C H
totalener: -1817.04369949 hartree
nucrepener: 2161.36351352 hartree
electener: -3978.40721301 hartree
oneelecener: -6788.18854218 hartree
twoeener: 2809.78132917 hartree
cpcmener: -0.02414102 hartree
kineticenergy: 1811.90732091 hartree
xcener: -128.815142653608 hartree
chargesum: 0.0000000
charge: -0.072923 -0.082715 -0.357086 -0.409084 0.133767 -0.351736 -0.408418 0.549894 0.149892 -0.002413 -0.157249 -0.112952 -0.074642 -0.114141 -0.019167 -0.154869 -0.273188 -0.148734 -0.176018 0.048579 0.112003 0.057073 0.093775 0.086126 0.111365 0.081789 0.075397 0.135299 0.135202 0.077467 0.062199 0.148432 0.079156 0.093829 0.085245 0.121734 0.145164 0.171694 0.160255
qa: -0.0729 -0.0827 -0.3571 -0.4091 0.1338 -0.3517 -0.4084 0.5499 0.1499 -0.0024 -0.1572 -0.1130 -0.0746 -0.1141 -0.0192 -0.1549 -0.2732 -0.1487 -0.1760 0.0486 0.1120 0.0571 0.0938 0.0861 0.1114 0.0818 0.0754 0.1353 0.1352 0.0775 0.0622 0.1484 0.0792 0.0938 0.0852 0.1217 0.1452 0.1717 0.1603
va: 1.2456 1.2214 2.0203 1.9652 3.3812 2.8883 3.0226 3.9094 3.8389 3.9400 3.9483 3.8225 3.6041 3.8964 4.0031 3.9656 3.9303 4.0799 4.0406 4.0595 3.8615 4.0387 0.9985 0.9959 0.9994 1.0102 1.0195 1.0282 1.0069 1.0070 1.0078 1.0270 0.9998 1.0044 1.0004 1.0259 1.0068 1.0002 0.9962
dispcorr: -0.021880676 hartree
energy: -1817.065580168767
dipole: -34.14744 34.79182 0.64438 -13.74104 13.07101 -0.67003 13.38378 -11.99006 1.39372
magnitude: 1.67529 au
magnitude: 4.25826 debye
