program: Orca
programVersion: 4.2.1
elementType: Cl Cl O O N N N C C C C C C C C C C C C C C C H H H H H H H H H H H H H H H H H
charge: 0
multiplicity: 1
keywords: wb97x-d3
keywords: def2-TZVPP
keywords: def2/J RIJCOSX GRIDX6 NOFINALGRIDX
keywords: grid4 nofinalgrid
keywords: scfconv7
keywords: smallprint printgap noloewdin
keywords: NOSOSCF
formula: C15H17Cl2N3O2
InChI: InChI=1S/C15H17Cl2N3O2/c1-2-3-12-7-21-15(22-12,8-20-10-18-9-19-20)13-5-4-11(16)6-14(13)17/h4-6,9-10,12H,2-3,7-8H2,1H3
39 atoms
Cl 1.192523 -1.498217 -2.091274
Cl 4.944809 1.401851 0.336458
O  -0.978207 -1.76003 -0.128679
O  -1.480738 -0.066746 1.248883
N  -1.383629 1.779887 -1.006099
N  -2.131963 2.516363 -0.182555
N  -0.633237 3.801787 -1.239232
C  -0.830444 -0.380095 0.058752
C  -1.557478 -2.345909 1.03951
C  -1.414642 -1.226919 2.061428
C  -2.993226 -2.766371 0.76936
C  -1.536089 0.351508 -1.092698
C  0.646335 0.010949 0.126165
C  -3.584269 -3.60964 1.892769
C  1.59968 -0.427226 -0.791391
C  1.071347 0.909115 1.10097
C  -5.027204 -4.004236 1.61872
C  2.920943 -0.009081 -0.73253
C  2.383475 1.342702 1.184782
C  -0.490107 2.557725 -1.624139
C  3.301054 0.874385 0.261865
C  -1.649307 3.719161 -0.357693
H  -0.956998 -3.217177 1.316381
H  -2.221722 -1.181556 2.792029
H  -0.462389 -1.28548 2.600354
H  -3.01905 -3.340334 -0.161747
H  -3.613261 -1.877641 0.607468
H  -2.598742 0.108619 -1.080761
H  -1.130058 0.023185 -2.048081
H  -3.536131 -3.064876 2.840502
H  -2.977162 -4.509555 2.029559
H  0.359429 1.291926 1.818785
H  -5.432877 -4.616059 2.425477
H  -5.667614 -3.125593 1.519582
H  -5.114399 -4.57936 0.694859
H  3.638985 -0.36828 -1.456564
H  2.675707 2.040838 1.956603
H  0.221905 2.180656 -2.342229
H  -2.048954 4.573381 0.16653
elementType: Cl O N C H
totalener: -1817.04352635 hartree
nucrepener: 2167.90599878 hartree
electener: -3984.94952514 hartree
oneelecener: -6801.32953017 hartree
twoeener: 2816.38000504 hartree
cpcmener: -0.02512041 hartree
kineticenergy: 1811.90789620 hartree
xcener: -128.813101770115 hartree
chargesum: 0.0000000
charge: -0.071716 -0.081618 -0.385914 -0.374590 0.127149 -0.344863 -0.401156 0.605398 0.209789 -0.023502 -0.195145 -0.147284 -0.119450 -0.087700 -0.063037 -0.125378 -0.278115 -0.122159 -0.179041 0.059233 0.111675 0.062585 0.090834 0.108617 0.099012 0.071659 0.075116 0.122077 0.139799 0.059212 0.063779 0.147809 0.091726 0.080521 0.079709 0.121053 0.146394 0.166195 0.161326
qa: -0.0717 -0.0816 -0.3859 -0.3746 0.1271 -0.3449 -0.4012 0.6054 0.2098 -0.0235 -0.1951 -0.1473 -0.1195 -0.0877 -0.0630 -0.1254 -0.2781 -0.1222 -0.1790 0.0592 0.1117 0.0626 0.0908 0.1086 0.0990 0.0717 0.0751 0.1221 0.1398 0.0592 0.0638 0.1478 0.0917 0.0805 0.0797 0.1211 0.1464 0.1662 0.1613
va: 1.2482 1.2223 2.0174 1.9870 3.3418 2.8923 3.0319 3.8159 3.8876 3.9673 3.9458 3.9191 3.6026 3.8697 4.0256 3.8468 3.9423 4.0679 4.0647 4.0698 3.8709 4.0501 0.9982 1.0006 0.9975 1.0212 1.0126 1.0225 1.0137 1.0120 1.0086 1.0265 1.0034 1.0013 1.0008 1.0251 1.0053 0.9960 0.9954
dispcorr: -0.021836159 hartree
energy: -1817.065362513903
dipole: -38.28665 37.84110 -0.44555 -19.48859 17.68371 -1.80487 15.12390 -14.32849 0.79541
magnitude: 2.02207 au
magnitude: 5.13969 debye
