program: Orca
programVersion: 4.2.1
elementType: Cl Cl O O N N N C C C C C C C C C C C C C C C H H H H H H H H H H H H H H H H H
charge: 0
multiplicity: 1
keywords: wb97x-d3
keywords: def2-TZVPP
keywords: def2/J RIJCOSX GRIDX6 NOFINALGRIDX
keywords: grid4 nofinalgrid
keywords: scfconv7
keywords: smallprint printgap noloewdin
keywords: NOSOSCF
formula: C15H17Cl2N3O2
InChI: InChI=1S/C15H17Cl2N3O2/c1-2-3-12-7-21-15(22-12,8-20-10-18-9-19-20)13-5-4-11(16)6-14(13)17/h4-6,9-10,12H,2-3,7-8H2,1H3
39 atoms
Cl -0.028748 -1.356925 -2.055194
Cl 4.823019 0.330842 -0.63589
O  -1.634263 -1.219276 0.445397
O  -1.326944 0.450973 1.868353
N  -1.231537 2.183893 -0.722822
N  -1.001725 3.130389 0.187296
N  -0.064132 3.679483 -1.771212
C  -1.105153 0.061226 0.545589
C  -1.394238 -1.881712 1.68087
C  -1.232747 -0.716047 2.672779
C  -2.547796 -2.811183 1.992222
C  -1.914653 0.962691 -0.396352
C  0.39082 0.094459 0.225496
C  -2.776986 -3.888277 0.938984
C  0.94688 -0.511829 -0.899029
C  1.255451 0.79763 1.059276
C  -3.951434 -4.789572 1.286976
C  2.305243 -0.447287 -1.171172
C  2.615344 0.878382 0.814393
C  -0.659134 2.518098 -1.881696
C  3.129518 0.246625 -0.303236
C  -0.301682 4.00701 -0.486174
H  -0.462119 -2.45593 1.612886
H  -2.029743 -0.682207 3.418241
H  -0.274854 -0.762001 3.198033
H  -3.459183 -2.218225 2.127267
H  -2.340268 -3.282308 2.958405
H  -2.878463 1.1892 0.059289
H  -2.102991 0.435331 -1.328816
H  -1.87022 -4.490926 0.82828
H  -2.955421 -3.423036 -0.033307
H  0.860293 1.304732 1.927749
H  -3.798959 -5.298943 2.240694
H  -4.879129 -4.218848 1.364699
H  -4.103507 -5.557061 0.526647
H  2.709637 -0.9299 -2.050018
H  3.256378 1.430148 1.48773
H  -0.710374 1.897491 -2.762661
H  0.048801 4.922416 -0.035863
elementType: Cl O N C H
totalener: -1817.04374954 hartree
nucrepener: 2193.55389601 hartree
electener: -4010.59764555 hartree
oneelecener: -6852.73648830 hartree
twoeener: 2842.13884275 hartree
cpcmener: -0.02452589 hartree
kineticenergy: 1811.92769192 hartree
xcener: -128.816457190400 hartree
chargesum: 0.0000000
charge: -0.069230 -0.082219 -0.355463 -0.376243 0.131807 -0.350882 -0.401475 0.617279 0.160552 -0.018974 -0.175947 -0.147207 -0.097997 -0.056808 -0.081046 -0.169838 -0.286580 -0.109092 -0.165571 0.078084 0.099059 0.065037 0.085548 0.096175 0.095307 0.066558 0.079099 0.125749 0.138897 0.054903 0.059742 0.150317 0.078214 0.080394 0.091737 0.120511 0.145922 0.163534 0.160148
qa: -0.0692 -0.0822 -0.3555 -0.3762 0.1318 -0.3509 -0.4015 0.6173 0.1606 -0.0190 -0.1759 -0.1472 -0.0980 -0.0568 -0.0810 -0.1698 -0.2866 -0.1091 -0.1656 0.0781 0.0991 0.0650 0.0855 0.0962 0.0953 0.0666 0.0791 0.1257 0.1389 0.0549 0.0597 0.1503 0.0782 0.0804 0.0917 0.1205 0.1459 0.1635 0.1601
va: 1.2503 1.2219 2.0237 1.9830 3.3526 2.8788 3.0363 3.7558 3.8119 3.9669 3.9600 3.8813 3.5598 3.8385 4.0352 3.9096 3.9480 4.0452 4.0471 4.0443 3.8811 4.0437 1.0040 1.0028 0.9936 1.0141 1.0105 1.0270 1.0062 1.0103 1.0236 1.0284 1.0007 1.0002 1.0035 1.0239 1.0052 1.0014 0.9955
dispcorr: -0.022364634 hartree
energy: -1817.066114177730
dipole: -30.02521 29.35747 -0.66773 -18.93472 17.20978 -1.72494 18.29073 -17.25596 1.03477
magnitude: 2.11944 au
magnitude: 5.38720 debye
