program: Orca
programVersion: 4.2.1
elementType: Cl Cl O O N N N C C C C C C C C C C C C C C C H H H H H H H H H H H H H H H H H
charge: 0
multiplicity: 1
keywords: wb97x-d3
keywords: def2-TZVPP
keywords: def2/J RIJCOSX GRIDX6 NOFINALGRIDX
keywords: grid4 nofinalgrid
keywords: scfconv7
keywords: smallprint printgap noloewdin
keywords: NOSOSCF
formula: C15H17Cl2N3O2
InChI: InChI=1S/C15H17Cl2N3O2/c1-2-3-12-7-21-15(22-12,8-20-10-18-9-19-20)13-5-4-11(16)6-14(13)17/h4-6,9-10,12H,2-3,7-8H2,1H3
39 atoms
Cl 0.3928 -1.271596 -2.317756
Cl 4.705327 0.678296 0.125374
O  -1.768287 -1.28594 -0.295196
O  -1.830522 0.271887 1.287843
N  -1.254426 2.270625 -0.871629
N  -0.231295 2.62544 -1.654345
N  -0.552355 4.152977 -0.042218
C  -1.298943 -0.017093 0.023229
C  -1.763959 -2.03747 0.914487
C  -2.002535 -0.959136 1.98146
C  -2.835128 -3.106003 0.843891
C  -1.874222 0.975237 -0.993175
C  0.22686 0.065416 0.061369
C  -2.891414 -3.994296 2.084261
C  1.044064 -0.433558 -0.95004
C  0.848222 0.765421 1.091305
C  -1.665589 -4.875811 2.275972
C  2.419635 -0.261662 -0.933368
C  2.217642 0.964003 1.12921
C  -1.421107 3.180514 0.08952
C  2.993236 0.442431 0.110236
C  0.147395 3.756377 -1.122168
H  -0.775151 -2.491932 1.049359
H  -3.018769 -0.986058 2.382106
H  -1.300642 -1.041982 2.813978
H  -2.657744 -3.731071 -0.036019
H  -3.803638 -2.618295 0.700227
H  -2.949749 1.067649 -0.843015
H  -1.704191 0.623103 -2.007422
H  -3.775801 -4.629369 2.000456
H  -3.050969 -3.383981 2.978578
H  0.251281 1.183725 1.889051
H  -0.761785 -4.297513 2.47287
H  -1.803086 -5.553249 3.119441
H  -1.478623 -5.487383 1.391121
H  3.029873 -0.663741 -1.729826
H  2.663824 1.51851 1.942437
H  -2.18799 3.108761 0.843771
H  0.964401 4.32639 -1.535431
elementType: Cl O N C H
totalener: -1817.03299009 hartree
nucrepener: 2200.41799303 hartree
electener: -4017.45098311 hartree
oneelecener: -6866.57039089 hartree
twoeener: 2849.11940778 hartree
cpcmener: -0.02656462 hartree
kineticenergy: 1811.93507973 hartree
xcener: -128.819930150987 hartree
chargesum: 0.0000000
charge: -0.075295 -0.085171 -0.376360 -0.400348 0.113651 -0.334081 -0.406912 0.589888 0.113856 0.002948 -0.147900 -0.084941 -0.145028 -0.104905 -0.006519 -0.145768 -0.275410 -0.142158 -0.200878 0.054257 0.126797 0.058415 0.097899 0.096082 0.102643 0.078153 0.080818 0.133935 0.131417 0.077528 0.057838 0.157320 0.079772 0.094235 0.082773 0.120641 0.147742 0.171911 0.161156
qa: -0.0753 -0.0852 -0.3764 -0.4003 0.1137 -0.3341 -0.4069 0.5899 0.1139 0.0029 -0.1479 -0.0849 -0.1450 -0.1049 -0.0065 -0.1458 -0.2754 -0.1422 -0.2009 0.0543 0.1268 0.0584 0.0979 0.0961 0.1026 0.0782 0.0808 0.1339 0.1314 0.0775 0.0578 0.1573 0.0798 0.0942 0.0828 0.1206 0.1477 0.1719 0.1612
va: 1.2452 1.2186 2.0123 1.9623 3.3661 2.8838 3.0272 3.8446 3.8550 3.9150 3.9378 3.8173 3.5982 3.8886 3.9828 3.8874 3.9298 4.0868 4.0829 4.0730 3.8429 4.0435 0.9993 1.0014 0.9913 1.0130 1.0148 1.0197 1.0260 1.0060 1.0111 1.0177 1.0004 1.0032 1.0012 1.0257 1.0055 1.0062 0.9965
dispcorr: -0.022850112 hartree
energy: -1817.055840199660
dipole: -27.95160 26.54275 -1.40885 -20.79060 19.10240 -1.68820 19.33216 -17.84991 1.48225
magnitude: 2.65178 au
magnitude: 6.74030 debye
