program: Orca
programVersion: 4.2.1
elementType: Cl Cl O O N N N C C C C C C C C C C C C C C C H H H H H H H H H H H H H H H H H
charge: 0
multiplicity: 1
keywords: wb97x-d3
keywords: def2-TZVPP
keywords: def2/J RIJCOSX GRIDX6 NOFINALGRIDX
keywords: grid4 nofinalgrid
keywords: scfconv7
keywords: smallprint printgap noloewdin
keywords: NOSOSCF
formula: C15H17Cl2N3O2
InChI: InChI=1S/C15H17Cl2N3O2/c1-2-3-12-7-21-15(22-12,8-20-10-18-9-19-20)13-5-4-11(16)6-14(13)17/h4-6,9-10,12H,2-3,7-8H2,1H3
39 atoms
Cl 0.483539 1.978222 1.279482
Cl 5.013282 -0.016999 -0.651791
O  -1.364313 -1.801921 -0.335602
O  -1.580105 -0.025692 0.973478
N  -1.315341 1.66005 -1.497125
N  -2.022443 2.603163 -0.869617
N  -0.259069 3.511027 -1.921279
C  -1.008097 -0.451913 -0.218617
C  -1.509864 -2.345909 0.97996
C  -1.411395 -1.103232 1.87851
C  -2.829156 -3.088505 1.071448
C  -1.651383 0.26445 -1.410121
C  0.517329 -0.308196 -0.241568
C  -2.964175 -3.880115 2.366091
C  1.237483 0.723479 0.359468
C  1.244926 -1.238413 -0.982605
C  -4.290059 -4.619818 2.451883
C  2.618629 0.813947 0.241666
C  2.619034 -1.168144 -1.122015
C  -0.267548 2.215381 -2.109118
C  3.296824 -0.134316 -0.500164
C  -1.350462 3.686945 -1.152465
H  -0.680718 -3.032199 1.180874
H  -2.198671 -1.046244 2.630158
H  -0.444547 -1.045649 2.388456
H  -2.907502 -3.775841 0.224089
H  -3.654904 -2.374918 0.979809
H  -2.734795 0.172968 -1.346323
H  -1.327083 -0.220486 -2.329971
H  -2.867155 -3.213392 3.228174
H  -2.139893 -4.595116 2.440535
H  0.725827 -2.049881 -1.472784
H  -4.408818 -5.317354 1.620872
H  -4.366752 -5.193204 3.376095
H  -5.13333 -3.927616 2.423192
H  3.151276 1.622471 0.722536
H  3.145222 -1.909593 -1.70618
H  0.439298 1.647595 -2.694007
H  -1.668163 4.654682 -0.797849
elementType: Cl O N C H
totalener: -1817.03315712 hartree
nucrepener: 2186.72647833 hartree
electener: -4003.75963546 hartree
oneelecener: -6839.12662396 hartree
twoeener: 2835.36698851 hartree
cpcmener: -0.03188679 hartree
kineticenergy: 1811.93563990 hartree
xcener: -128.819210101203 hartree
chargesum: 0.0000000
charge: -0.069548 -0.082694 -0.410255 -0.363999 0.104488 -0.340110 -0.398792 0.587144 0.156928 -0.005474 -0.167664 -0.070476 -0.139257 -0.083979 -0.020228 -0.162841 -0.285062 -0.107565 -0.181050 0.039132 0.104782 0.053380 0.092280 0.112175 0.097648 0.072959 0.074220 0.120388 0.140416 0.060312 0.063789 0.146522 0.080983 0.091851 0.080998 0.120636 0.148499 0.179597 0.159867
qa: -0.0695 -0.0827 -0.4103 -0.3640 0.1045 -0.3401 -0.3988 0.5871 0.1569 -0.0055 -0.1677 -0.0705 -0.1393 -0.0840 -0.0202 -0.1628 -0.2851 -0.1076 -0.1810 0.0391 0.1048 0.0534 0.0923 0.1122 0.0976 0.0730 0.0742 0.1204 0.1404 0.0603 0.0638 0.1465 0.0810 0.0919 0.0810 0.1206 0.1485 0.1796 0.1599
va: 1.2490 1.2216 1.9771 1.9954 3.3692 2.8704 3.0179 3.8729 3.8340 3.9095 3.9620 3.8332 3.5841 3.8663 3.9320 3.9878 3.9436 4.0476 4.0373 4.0855 3.8710 4.0621 1.0039 0.9982 1.0029 1.0175 1.0114 1.0292 1.0027 1.0109 1.0091 1.0238 1.0003 1.0031 1.0007 1.0262 1.0049 0.9899 0.9965
dispcorr: -0.022295263 hartree
energy: -1817.055452386354
dipole: -32.87973 32.74718 -0.13255 -30.06403 27.23566 -2.82837 9.23344 -9.12079 0.11265
magnitude: 2.83371 au
magnitude: 7.20272 debye
