program: Orca
programVersion: 4.2.1
elementType: Cl Cl O O N N N C C C C C C C C C C C C C C C H H H H H H H H H H H H H H H H H
charge: 0
multiplicity: 1
keywords: wb97x-d3
keywords: def2-TZVPP
keywords: def2/J RIJCOSX GRIDX6 NOFINALGRIDX
keywords: grid4 nofinalgrid
keywords: scfconv7
keywords: smallprint printgap noloewdin
keywords: NOSOSCF
formula: C15H17Cl2N3O2
InChI: InChI=1S/C15H17Cl2N3O2/c1-2-3-12-7-21-15(22-12,8-20-10-18-9-19-20)13-5-4-11(16)6-14(13)17/h4-6,9-10,12H,2-3,7-8H2,1H3
39 atoms
Cl 1.216443 -0.026295 -2.456699
Cl 5.665723 -0.606436 0.411346
O  -0.980368 -0.494741 -0.536341
O  -0.804595 0.27342 1.567273
N  -1.974299 2.113799 -0.254158
N  -2.621666 2.603031 0.808382
N  -4.074426 2.053528 -0.812504
C  -0.292531 0.409888 0.268012
C  -1.593078 -1.479608 0.292112
C  -1.849217 -0.685858 1.562585
C  -2.806842 -2.031587 -0.428091
C  -0.562863 1.836852 -0.231798
C  1.208346 0.138082 0.278068
C  -3.48586 -3.203002 0.276743
C  1.948186 -0.062748 -0.886943
C  1.903468 0.115388 1.483544
C  -4.254834 -2.843891 1.541096
C  3.315332 -0.294072 -0.855302
C  3.268102 -0.110656 1.544355
C  -2.853496 1.778361 -1.199809
C  3.963048 -0.318428 0.366834
C  -3.869237 2.549863 0.422757
H  -0.881125 -2.29206 0.491291
H  -2.82679 -0.18985 1.54855
H  -1.775205 -1.287002 2.468104
H  -2.480342 -2.366368 -1.415612
H  -3.529971 -1.226082 -0.594371
H  -0.164712 1.982325 -1.23428
H  -0.075229 2.558097 0.421216
H  -2.744144 -3.974903 0.501536
H  -4.180574 -3.655307 -0.433969
H  1.372331 0.274593 2.410311
H  -3.6029 -2.543459 2.361792
H  -4.958398 -2.029177 1.359633
H  -4.831379 -3.698875 1.896068
H  3.862309 -0.452352 -1.774089
H  3.773308 -0.1245 2.499596
H  -2.564073 1.363076 -2.151464
H  -4.669982 2.893394 1.058567
elementType: Cl O N C H
totalener: -1817.03369754 hartree
nucrepener: 2168.26707578 hartree
electener: -3985.30077333 hartree
oneelecener: -6801.83277126 hartree
twoeener: 2816.53199794 hartree
cpcmener: -0.02535227 hartree
kineticenergy: 1811.93163890 hartree
xcener: -128.819858018824 hartree
chargesum: -0.0000000
charge: -0.076093 -0.084238 -0.370799 -0.407773 0.142772 -0.363078 -0.411946 0.566432 0.201674 -0.051545 -0.153686 -0.126848 -0.065322 -0.101018 -0.025316 -0.151686 -0.292764 -0.149331 -0.175589 0.048635 0.112445 0.057182 0.086973 0.091283 0.117525 0.080975 0.069410 0.147049 0.130785 0.060130 0.076338 0.149725 0.084930 0.085580 0.098885 0.122668 0.147664 0.166091 0.161882
qa: -0.0761 -0.0842 -0.3708 -0.4078 0.1428 -0.3631 -0.4119 0.5664 0.2017 -0.0515 -0.1537 -0.1268 -0.0653 -0.1010 -0.0253 -0.1517 -0.2928 -0.1493 -0.1756 0.0486 0.1124 0.0572 0.0870 0.0913 0.1175 0.0810 0.0694 0.1470 0.1308 0.0601 0.0763 0.1497 0.0849 0.0856 0.0989 0.1227 0.1477 0.1661 0.1619
va: 1.2423 1.2198 2.0081 1.9703 3.3430 2.8795 3.0018 3.8763 3.7676 3.9859 3.9576 3.8063 3.5809 3.9052 4.0078 3.9624 3.9281 4.0819 4.0385 4.0673 3.8572 4.0480 1.0062 0.9871 0.9994 1.0161 1.0138 1.0166 1.0221 1.0082 1.0034 1.0258 1.0003 1.0016 1.0043 1.0255 1.0061 1.0047 0.9965
dispcorr: -0.022362275 hartree
energy: -1817.056059816679
dipole: -37.40017 37.99757 0.59740 -13.10865 11.95082 -1.15783 11.46912 -11.14699 0.32213
magnitude: 1.34210 au
magnitude: 3.41134 debye
