program: Orca
programVersion: 4.2.1
elementType: Cl Cl O O N N N C C C C C C C C C C C C C C C H H H H H H H H H H H H H H H H H
charge: 0
multiplicity: 1
keywords: wb97x-d3
keywords: def2-TZVPP
keywords: def2/J RIJCOSX GRIDX6 NOFINALGRIDX
keywords: grid4 nofinalgrid
keywords: scfconv7
keywords: smallprint printgap noloewdin
keywords: NOSOSCF
formula: C15H17Cl2N3O2
InChI: InChI=1S/C15H17Cl2N3O2/c1-2-3-12-7-21-15(22-12,8-20-10-18-9-19-20)13-5-4-11(16)6-14(13)17/h4-6,9-10,12H,2-3,7-8H2,1H3
39 atoms
Cl 0.766695 2.149901 1.044154
Cl 4.798326 -0.606695 -1.046288
O  -1.624015 -1.578625 0.21731
O  -1.494445 0.359106 1.283902
N  -1.520782 1.738865 -1.297313
N  -0.495501 2.088842 -2.079241
N  -1.413483 3.901691 -1.126391
C  -1.135367 -0.274151 0.09773
C  -1.54371 -1.949662 1.596039
C  -1.307965 -0.604642 2.306179
C  -2.824132 -2.647312 2.009404
C  -1.88493 0.366673 -1.073459
C  0.378822 -0.302402 -0.13012
C  -3.139473 -3.917985 1.226339
C  1.268234 0.705192 0.237439
C  0.91105 -1.402296 -0.800883
C  -2.095304 -5.014849 1.384514
C  2.626605 0.613573 -0.03616
C  2.258055 -1.515859 -1.093431
C  -2.045688 2.826078 -0.729991
C  3.108746 -0.497788 -0.701237
C  -0.471447 3.388199 -1.939057
H  -0.682549 -2.608717 1.745991
H  -2.028531 -0.409005 3.100435
H  -0.301399 -0.542937 2.730453
H  -3.65481 -1.940189 1.922106
H  -2.735116 -2.890098 3.072607
H  -2.954522 0.324917 -0.867517
H  -1.696629 -0.195746 -1.986217
H  -3.268811 -3.680603 0.167627
H  -4.106846 -4.294137 1.567296
H  0.253839 -2.203373 -1.108636
H  -1.920437 -5.24591 2.437192
H  -2.418548 -5.934803 0.896442
H  -1.135419 -4.73975 0.945006
H  3.295359 1.407172 0.266127
H  2.630701 -2.38574 -1.615369
H  -2.890348 2.787828 -0.061118
H  0.253163 3.995628 -2.457987
elementType: Cl O N C H
totalener: -1817.03254975 hartree
nucrepener: 2206.15297990 hartree
electener: -4023.18552964 hartree
oneelecener: -6878.26718040 hartree
twoeener: 2855.08165076 hartree
cpcmener: -0.02840615 hartree
kineticenergy: 1811.93570448 hartree
xcener: -128.820724955831 hartree
chargesum: -0.0000000
charge: -0.073461 -0.084865 -0.393224 -0.368058 0.096821 -0.347403 -0.404088 0.599592 0.128330 -0.010424 -0.181888 -0.060335 -0.054198 -0.088925 -0.074647 -0.201048 -0.285144 -0.108020 -0.171666 0.065153 0.094612 0.056430 0.100193 0.108090 0.096356 0.081506 0.083104 0.125850 0.131288 0.059038 0.072213 0.148969 0.083871 0.094600 0.080883 0.119609 0.148617 0.171814 0.160457
qa: -0.0735 -0.0849 -0.3932 -0.3681 0.0968 -0.3474 -0.4041 0.5996 0.1283 -0.0104 -0.1819 -0.0603 -0.0542 -0.0889 -0.0746 -0.2010 -0.2851 -0.1080 -0.1717 0.0652 0.0946 0.0564 0.1002 0.1081 0.0964 0.0815 0.0831 0.1259 0.1313 0.0590 0.0722 0.1490 0.0839 0.0946 0.0809 0.1196 0.1486 0.1718 0.1605
va: 1.2438 1.2196 1.9754 1.9916 3.3723 2.8702 3.0216 3.8231 3.7907 3.9528 3.9775 3.8296 3.4992 3.8595 3.9837 4.0156 3.9335 4.0303 4.0170 4.0720 3.8702 4.0574 0.9961 0.9988 1.0012 1.0130 1.0085 1.0190 1.0111 1.0207 1.0080 1.0204 1.0001 1.0035 0.9983 1.0257 1.0048 0.9995 0.9970
dispcorr: -0.022675880 hartree
energy: -1817.055225625373
dipole: -29.64527 28.49392 -1.15135 -28.51956 26.09911 -2.42046 10.09078 -9.00315 1.08763
magnitude: 2.89261 au
magnitude: 7.35242 debye
