program: Orca
programVersion: 4.2.1
elementType: Cl Cl O O N N N C C C C C C C C C C C C C C C H H H H H H H H H H H H H H H H H
charge: 0
multiplicity: 1
keywords: wb97x-d3
keywords: def2-TZVPP
keywords: def2/J RIJCOSX GRIDX6 NOFINALGRIDX
keywords: grid4 nofinalgrid
keywords: scfconv7
keywords: smallprint printgap noloewdin
keywords: NOSOSCF
formula: C15H17Cl2N3O2
InChI: InChI=1S/C15H17Cl2N3O2/c1-2-3-12-7-21-15(22-12,8-20-10-18-9-19-20)13-5-4-11(16)6-14(13)17/h4-6,9-10,12H,2-3,7-8H2,1H3
39 atoms
Cl 0.657526 -0.897806 -2.192585
Cl 5.457408 -0.990317 0.106784
O  -1.226218 -0.399065 -0.017672
O  -0.68658 0.947208 1.697895
N  -1.976212 2.257068 -0.474808
N  -2.425377 3.129176 0.433276
N  -4.135306 2.252079 -0.727174
C  -0.363647 0.618779 0.36978
C  -1.732355 -1.03122 1.151913
C  -1.760548 0.126502 2.131705
C  -3.079758 -1.648007 0.856766
C  -0.599412 1.843587 -0.525105
C  1.09809 0.190852 0.28455
C  -3.047295 -2.777557 -0.168658
C  1.624147 -0.485932 -0.815552
C  1.976056 0.504823 1.317733
C  -2.258021 -3.997442 0.282384
C  2.959735 -0.855358 -0.875764
C  3.314933 0.154105 1.280681
C  -3.006134 1.732343 -1.140253
C  3.793688 -0.531855 0.179284
C  -3.716685 3.093592 0.237385
H  -1.023754 -1.794446 1.499055
H  -2.707932 0.676306 2.086204
H  -1.586936 -0.183976 3.161804
H  -3.75906 -0.859749 0.519092
H  -3.485857 -2.024968 1.800547
H  -0.338453 1.624888 -1.559298
H  0.02645 2.671179 -0.197063
H  -2.644242 -2.405686 -1.113734
H  -4.077671 -3.074607 -0.37604
H  1.61324 1.039169 2.183422
H  -2.616526 -4.367654 1.24476
H  -2.351764 -4.811639 -0.436989
H  -1.193337 -3.785322 0.387506
H  3.338839 -1.387773 -1.736658
H  3.967059 0.413889 2.102514
H  -2.88795 1.0038 -1.925693
H  -4.390124 3.710189 0.811498
elementType: Cl O N C H
totalener: -1817.03468270 hartree
nucrepener: 2185.28547229 hartree
electener: -4002.32015499 hartree
oneelecener: -6835.81958175 hartree
twoeener: 2833.49942677 hartree
cpcmener: -0.02520984 hartree
kineticenergy: 1811.94868296 hartree
xcener: -128.822814553353 hartree
chargesum: 0.0000000
charge: -0.076070 -0.084561 -0.360781 -0.403900 0.142970 -0.363411 -0.413700 0.585550 0.144893 -0.007574 -0.174004 -0.120142 -0.079639 -0.087542 -0.017881 -0.155668 -0.283784 -0.151217 -0.175641 0.052661 0.112281 0.057400 0.095569 0.079845 0.112028 0.072907 0.091642 0.145812 0.129340 0.058913 0.074243 0.149217 0.082879 0.093451 0.079205 0.122642 0.147118 0.163913 0.161036
qa: -0.0761 -0.0846 -0.3608 -0.4039 0.1430 -0.3634 -0.4137 0.5855 0.1449 -0.0076 -0.1740 -0.1201 -0.0796 -0.0875 -0.0179 -0.1557 -0.2838 -0.1512 -0.1756 0.0527 0.1123 0.0574 0.0956 0.0798 0.1120 0.0729 0.0916 0.1458 0.1293 0.0589 0.0742 0.1492 0.0829 0.0935 0.0792 0.1226 0.1471 0.1639 0.1610
va: 1.2404 1.2198 1.9977 1.9678 3.3440 2.8840 3.0047 3.8375 3.8294 3.9946 3.9491 3.8128 3.5866 3.8648 3.9931 3.9674 3.9380 4.0795 4.0401 4.0697 3.8554 4.0506 0.9973 0.9974 1.0016 1.0200 1.0095 1.0135 1.0227 1.0181 1.0076 1.0264 1.0002 1.0034 0.9985 1.0258 1.0064 1.0050 0.9966
dispcorr: -0.022689926 hartree
energy: -1817.057372625239
dipole: -30.31403 30.89249 0.57846 -10.07040 9.03841 -1.03199 10.53327 -9.97829 0.55498
magnitude: 1.30676 au
magnitude: 3.32152 debye
