program: Orca
programVersion: 4.2.1
elementType: Cl Cl O O N N N C C C C C C C C C C C C C C C H H H H H H H H H H H H H H H H H
charge: 0
multiplicity: 1
keywords: wb97x-d3
keywords: def2-TZVPP
keywords: def2/J RIJCOSX GRIDX6 NOFINALGRIDX
keywords: grid4 nofinalgrid
keywords: scfconv7
keywords: smallprint printgap noloewdin
keywords: NOSOSCF
formula: C15H17Cl2N3O2
InChI: InChI=1S/C15H17Cl2N3O2/c1-2-3-12-7-21-15(22-12,8-20-10-18-9-19-20)13-5-4-11(16)6-14(13)17/h4-6,9-10,12H,2-3,7-8H2,1H3
39 atoms
Cl 1.656379 2.20811 1.102176
Cl 5.625931 -1.117589 -0.14785
O  -1.009152 -1.0353 -0.558408
O  -0.735281 0.504207 1.05724
N  -1.956809 1.628436 -1.18041
N  -2.942276 1.034221 -1.860418
N  -3.770756 2.611609 -0.495892
C  -0.292168 0.104934 -0.209225
C  -1.655875 -1.556827 0.590849
C  -1.823369 -0.308524 1.444557
C  -2.948653 -2.233676 0.188987
C  -0.59409 1.185972 -1.263325
C  1.205862 -0.174678 -0.166492
C  -3.722998 -2.765135 1.389894
C  2.133002 0.701326 0.396083
C  1.699306 -1.342364 -0.738665
C  -5.003535 -3.478137 0.980972
C  3.490126 0.417529 0.405662
C  3.049379 -1.648189 -0.741521
C  -2.470267 2.562073 -0.364582
C  3.939316 -0.761758 -0.16198
C  -4.008547 1.65886 -1.423319
H  -0.99443 -2.27574 1.097143
H  -2.781376 0.189597 1.246329
H  -1.751704 -0.505447 2.514774
H  -2.725265 -3.057367 -0.494905
H  -3.557889 -1.519258 -0.372487
H  -0.415368 0.787187 -2.261077
H  0.059157 2.046114 -1.121079
H  -3.972546 -1.943235 2.068195
H  -3.091104 -3.449913 1.964084
H  1.006317 -2.035276 -1.194364
H  -5.668495 -2.81057 0.431326
H  -4.792238 -4.333175 0.337399
H  -5.549534 -3.845817 1.849462
H  4.186166 1.112533 0.853213
H  3.401857 -2.565943 -1.19043
H  -1.862973 3.16586 0.291915
H  -4.994973 1.424058 -1.791993
totalener: -1817.01943322 hartree
nucrepener: 2151.97179699 hartree
electener: -3968.99123022 hartree
oneelecener: -6769.03358755 hartree
twoeener: 2800.04235733 hartree
kineticenergy: 1811.91046587 hartree
xcener: -128.813112227663 hartree
chargesum: 0.0000000
charge: -0.061889 -0.065280 -0.359032 -0.351728 0.128861 -0.319347 -0.329236 0.575484 0.170900 -0.032588 -0.167895 -0.163918 -0.072827 -0.091816 -0.064822 -0.116897 -0.261574 -0.145027 -0.160280 0.036859 0.103664 0.052927 0.076856 0.086027 0.099896 0.072444 0.076646 0.122557 0.139101 0.061702 0.061956 0.140927 0.078861 0.076024 0.087631 0.114673 0.125240 0.142085 0.132834
qa: -0.0619 -0.0653 -0.3590 -0.3517 0.1289 -0.3193 -0.3292 0.5755 0.1709 -0.0326 -0.1679 -0.1639 -0.0728 -0.0918 -0.0648 -0.1169 -0.2616 -0.1450 -0.1603 0.0369 0.1037 0.0529 0.0769 0.0860 0.0999 0.0724 0.0766 0.1226 0.1391 0.0617 0.0620 0.1409 0.0789 0.0760 0.0876 0.1147 0.1252 0.1421 0.1328
va: 1.2592 1.2400 2.0377 2.0209 3.3355 2.8577 3.0535 3.8279 3.8296 3.9995 3.9535 3.8503 3.6320 3.8620 4.0690 3.9226 3.9605 4.0690 4.0530 4.0662 3.9319 4.0232 1.0026 0.9878 0.9967 1.0164 1.0229 1.0287 1.0135 1.0085 1.0075 1.0264 1.0030 1.0031 1.0045 1.0262 1.0145 1.0121 1.0020
dispcorr: -0.021755434 hartree
energy: -1817.041188657300
dipole: -40.92905 41.25683 0.32778 -19.55528 18.59883 -0.95645 2.65466 -2.36102 0.29364
magnitude: 1.05283 au
magnitude: 2.67609 debye
