program: Orca
programVersion: 4.2.1
elementType: Cl Cl O O N N N C C C C C C C C C C C C C C C H H H H H H H H H H H H H H H H H
charge: 0
multiplicity: 1
keywords: wb97x-d3
keywords: def2-TZVPP
keywords: def2/J RIJCOSX GRIDX6 NOFINALGRIDX
keywords: grid4 nofinalgrid
keywords: scfconv7
keywords: smallprint printgap noloewdin
keywords: NOSOSCF
formula: C15H17Cl2N3O2
InChI: InChI=1S/C15H17Cl2N3O2/c1-2-3-12-7-21-15(22-12,8-20-10-18-9-19-20)13-5-4-11(16)6-14(13)17/h4-6,9-10,12H,2-3,7-8H2,1H3
39 atoms
Cl 0.387285 -1.319924 -2.365313
Cl 4.765875 0.312169 0.190453
O  -1.764552 -1.265687 -0.333297
O  -1.791206 0.30945 1.230866
N  -1.30577 2.311339 -0.8321
N  -0.269689 2.76927 -1.541645
N  -0.854112 4.251383 0.035472
C  -1.266977 -0.006819 -0.032045
C  -1.750492 -1.999114 0.877926
C  -1.992507 -0.903852 1.931018
C  -2.808817 -3.082241 0.831148
C  -1.824046 0.989482 -1.051581
C  0.259676 0.029144 0.008984
C  -2.856941 -3.940239 2.093759
C  1.061894 -0.521766 -0.988028
C  0.902802 0.690339 1.050237
C  -1.605421 -4.776269 2.330919
C  2.444809 -0.442972 -0.9352
C  2.280966 0.788787 1.122589
C  -1.636449 3.206358 0.111558
C  3.045566 0.211997 0.124838
C  -0.035196 3.933406 -0.989979
H  -0.757167 -2.444274 1.020751
H  -3.01587 -0.918826 2.317381
H  -1.304887 -0.989717 2.777044
H  -2.621573 -3.721595 -0.035802
H  -3.782041 -2.609958 0.668679
H  -2.912452 0.999111 -0.977163
H  -1.550477 0.690408 -2.060855
H  -3.719729 -4.605466 2.018668
H  -3.050952 -3.31193 2.968993
H  0.308899 1.154349 1.824708
H  -0.724658 -4.162892 2.524164
H  -1.732695 -5.43358 3.19069
H  -1.382384 -5.404779 1.46737
H  3.043211 -0.882271 -1.720311
H  2.750553 1.312937 1.942664
H  -2.440599 3.053822 0.813818
H  0.752717 4.580208 -1.341948
totalener: -1817.01738482 hartree
nucrepener: 2191.15360127 hartree
electener: -4008.17098609 hartree
oneelecener: -6847.62622510 hartree
twoeener: 2839.45523901 hartree
kineticenergy: 1811.92076113 hartree
xcener: -128.815402965175 hartree
chargesum: 0.0000000
charge: -0.059450 -0.068416 -0.333173 -0.369428 0.107411 -0.302756 -0.328088 0.578699 0.110559 -0.012880 -0.158638 -0.098986 -0.171566 -0.107152 0.008388 -0.117239 -0.257560 -0.139384 -0.183802 0.037121 0.120166 0.060264 0.088763 0.080917 0.086532 0.083391 0.075459 0.111672 0.130819 0.077226 0.052862 0.139675 0.074072 0.091033 0.083389 0.110711 0.124387 0.144100 0.130902
qa: -0.0595 -0.0684 -0.3332 -0.3694 0.1074 -0.3028 -0.3281 0.5787 0.1106 -0.0129 -0.1586 -0.0990 -0.1716 -0.1072 0.0084 -0.1172 -0.2576 -0.1394 -0.1838 0.0371 0.1202 0.0603 0.0888 0.0809 0.0865 0.0834 0.0755 0.1117 0.1308 0.0772 0.0529 0.1397 0.0741 0.0910 0.0834 0.1107 0.1244 0.1441 0.1309
va: 1.2641 1.2368 2.0539 1.9910 3.3268 2.8547 3.0649 3.8470 3.8723 3.9604 3.9442 3.8408 3.6181 3.8759 4.0247 3.8975 3.9346 4.0877 4.1078 4.0823 3.9174 4.0455 0.9996 1.0004 0.9902 1.0148 1.0181 1.0225 1.0300 1.0079 1.0111 1.0230 1.0028 1.0056 1.0035 1.0282 1.0137 1.0129 1.0020
dispcorr: -0.022440987 hartree
energy: -1817.039825807056
dipole: -27.75471 26.79747 -0.95724 -19.39051 17.93249 -1.45802 19.24481 -18.31196 0.93285
magnitude: 1.97797 au
magnitude: 5.02760 debye
