program: Orca
programVersion: 4.2.1
elementType: Cl Cl O O N N N C C C C C C C C C C C C C C C H H H H H H H H H H H H H H H H H
charge: 0
multiplicity: 1
keywords: wb97x-d3
keywords: def2-TZVPP
keywords: def2/J RIJCOSX GRIDX6 NOFINALGRIDX
keywords: grid4 nofinalgrid
keywords: scfconv7
keywords: smallprint printgap noloewdin
keywords: NOSOSCF
formula: C15H17Cl2N3O2
InChI: InChI=1S/C15H17Cl2N3O2/c1-2-3-12-7-21-15(22-12,8-20-10-18-9-19-20)13-5-4-11(16)6-14(13)17/h4-6,9-10,12H,2-3,7-8H2,1H3
39 atoms
Cl 0.014823 -1.790814 -1.817524
Cl 4.757412 0.146921 -0.362598
O  -1.808496 -1.17826 0.403719
O  -1.560144 0.661313 1.620039
N  -1.358355 2.218038 -0.827539
N  -0.424215 2.498185 -1.741509
N  -0.774332 4.269049 -0.412311
C  -1.241229 0.085863 0.379597
C  -1.61353 -1.670668 1.71677
C  -1.688741 -0.388223 2.561882
C  -2.661932 -2.712555 2.040679
C  -1.920994 0.900181 -0.72381
C  0.274101 0.04823 0.190876
C  -2.669622 -3.914371 1.09882
C  0.904424 -0.743098 -0.766699
C  1.080343 0.883732 0.956962
C  -1.351174 -4.675085 1.042935
C  2.27986 -0.721374 -0.937727
C  2.45423 0.929226 0.801279
C  -1.549695 3.285489 -0.036707
C  3.046779 0.116919 -0.148576
C  -0.104716 3.73565 -1.456388
H  -0.610054 -2.108973 1.800339
H  -2.649321 -0.285629 3.074732
H  -0.891928 -0.346271 3.309347
H  -3.647446 -2.237128 2.03754
H  -2.485653 -3.053032 3.066517
H  -2.987888 0.968242 -0.506141
H  -1.795732 0.409344 -1.686568
H  -2.944928 -3.586796 0.094306
H  -3.463834 -4.590759 1.424304
H  0.619558 1.527815 1.692255
H  -1.014237 -4.968016 2.039093
H  -1.45501 -5.585613 0.453464
H  -0.559754 -4.085595 0.57996
H  2.743281 -1.347911 -1.686208
H  3.052904 1.59291 1.408665
H  -2.252529 3.295778 0.781274
H  0.634025 4.277246 -2.025683
totalener: -1817.01816732 hartree
nucrepener: 2210.82577791 hartree
electener: -4027.84394523 hartree
oneelecener: -6887.01740999 hartree
twoeener: 2859.17346475 hartree
kineticenergy: 1811.92121563 hartree
xcener: -128.815355880607 hartree
chargesum: -0.0000000
charge: -0.063167 -0.067938 -0.327685 -0.367554 0.104857 -0.304219 -0.328128 0.574620 0.103481 -0.008637 -0.174317 -0.089629 -0.152834 -0.084954 0.003564 -0.114962 -0.267859 -0.140533 -0.184063 0.039341 0.119606 0.060621 0.091419 0.077850 0.083864 0.068649 0.074194 0.111273 0.128619 0.071531 0.069781 0.139077 0.077648 0.089801 0.076410 0.111391 0.124364 0.143583 0.130933
qa: -0.0632 -0.0679 -0.3277 -0.3676 0.1049 -0.3042 -0.3281 0.5746 0.1035 -0.0086 -0.1743 -0.0896 -0.1528 -0.0850 0.0036 -0.1150 -0.2679 -0.1405 -0.1841 0.0393 0.1196 0.0606 0.0914 0.0779 0.0839 0.0686 0.0742 0.1113 0.1286 0.0715 0.0698 0.1391 0.0776 0.0898 0.0764 0.1114 0.1244 0.1436 0.1309
va: 1.2583 1.2372 2.0431 1.9913 3.3312 2.8536 3.0651 3.8514 3.8405 4.0031 3.9798 3.8371 3.5935 3.8596 4.0207 3.8986 3.9410 4.0888 4.1062 4.0806 3.9197 4.0451 0.9926 1.0010 0.9930 1.0187 1.0084 1.0231 1.0290 1.0191 1.0085 1.0231 1.0021 1.0074 1.0075 1.0276 1.0136 1.0130 1.0021
dispcorr: -0.023209652 hartree
energy: -1817.041376968341
dipole: -25.05342 24.24498 -0.80844 -15.88850 14.73066 -1.15784 17.42669 -16.25374 1.17295
magnitude: 1.83575 au
magnitude: 4.66610 debye
