program: Orca
programVersion: 4.2.1
elementType: Cl Cl O O N N N C C C C C C C C C C C C C C C H H H H H H H H H H H H H H H H H
charge: 0
multiplicity: 1
keywords: wb97x-d3
keywords: def2-TZVPP
keywords: def2/J RIJCOSX GRIDX6 NOFINALGRIDX
keywords: grid4 nofinalgrid
keywords: scfconv7
keywords: smallprint printgap noloewdin
keywords: NOSOSCF
formula: C15H17Cl2N3O2
InChI: InChI=1S/C15H17Cl2N3O2/c1-2-3-12-7-21-15(22-12,8-20-10-18-9-19-20)13-5-4-11(16)6-14(13)17/h4-6,9-10,12H,2-3,7-8H2,1H3
39 atoms
Cl 1.183418 -0.139612 -2.480892
Cl 5.606641 -0.640605 0.442745
O  -1.032661 -0.46672 -0.540126
O  -0.849126 0.416529 1.510812
N  -1.99955 2.178792 -0.344664
N  -2.776831 1.947431 -1.406491
N  -4.011603 2.653332 0.327916
C  -0.333701 0.467233 0.205071
C  -1.533887 -1.459785 0.336374
C  -1.776603 -0.648046 1.606036
C  -2.749266 -2.098977 -0.308006
C  -0.597361 1.871125 -0.359979
C  1.165101 0.175599 0.236323
C  -3.269902 -3.345372 0.402513
C  1.906469 -0.102283 -0.911932
C  1.852542 0.203911 1.445929
C  -3.899153 -3.104997 1.769037
C  3.269267 -0.355132 -0.853552
C  3.211825 -0.042962 1.528578
C  -2.755196 2.593211 0.684667
C  3.913428 -0.325505 0.370206
C  -3.97041 2.248944 -0.96062
H  -0.763704 -2.225314 0.516613
H  -2.798704 -0.25517 1.645202
H  -1.584042 -1.211787 2.520137
H  -2.47034 -2.370925 -1.328566
H  -3.543212 -1.350716 -0.396267
H  -0.244484 1.953401 -1.385425
H  -0.059128 2.602217 0.244879
H  -2.462987 -4.078974 0.492411
H  -4.016248 -3.808331 -0.246592
H  1.308183 0.420436 2.353529
H  -4.360496 -4.016543 2.148763
H  -3.170864 -2.787639 2.515918
H  -4.677181 -2.341624 1.719335
H  3.818362 -0.572854 -1.758452
H  3.716279 -0.017413 2.484032
H  -2.349391 2.840548 1.652996
H  -4.845346 2.181116 -1.587966
totalener: -1817.01668816 hartree
nucrepener: 2163.71764654 hartree
electener: -3980.73433470 hartree
oneelecener: -6792.63811880 hartree
twoeener: 2811.90378410 hartree
kineticenergy: 1811.91839086 hartree
xcener: -128.814326870999 hartree
chargesum: 0.0000000
charge: -0.047926 -0.065296 -0.324134 -0.391837 0.121578 -0.295678 -0.330554 0.542944 0.167837 -0.042760 -0.139744 -0.124342 -0.109008 -0.107402 -0.019658 -0.129322 -0.271786 -0.155354 -0.164427 0.015314 0.111239 0.046728 0.069061 0.096369 0.098405 0.086294 0.069564 0.133857 0.123141 0.054312 0.075122 0.136989 0.094755 0.073184 0.087608 0.113773 0.124683 0.146366 0.130104
qa: -0.0479 -0.0653 -0.3241 -0.3918 0.1216 -0.2957 -0.3306 0.5429 0.1678 -0.0428 -0.1397 -0.1243 -0.1090 -0.1074 -0.0197 -0.1293 -0.2718 -0.1554 -0.1644 0.0153 0.1112 0.0467 0.0691 0.0964 0.0984 0.0863 0.0696 0.1339 0.1231 0.0543 0.0751 0.1370 0.0948 0.0732 0.0876 0.1138 0.1247 0.1464 0.1301
va: 1.2738 1.2401 2.0499 1.9773 3.3574 2.8711 3.0471 3.9104 3.8160 3.9699 3.9555 3.8197 3.6188 3.8987 4.0496 3.9527 3.9256 4.0795 4.0553 4.0722 3.9214 4.0471 1.0039 0.9910 1.0021 1.0177 1.0164 1.0350 1.0059 1.0091 1.0063 1.0301 1.0072 1.0040 1.0037 1.0288 1.0145 1.0091 1.0019
dispcorr: -0.021981332 hartree
energy: -1817.038669490357
dipole: -35.61726 36.09244 0.47518 -13.19001 12.41573 -0.77428 13.71862 -12.84087 0.87776
magnitude: 1.26323 au
magnitude: 3.21088 debye
