program: Orca
programVersion: 4.2.1
elementType: Cl Cl O O N N N C C C C C C C C C C C C C C C H H H H H H H H H H H H H H H H H
charge: 0
multiplicity: 1
keywords: wb97x-d3
keywords: def2-TZVPP
keywords: def2/J RIJCOSX GRIDX6 NOFINALGRIDX
keywords: grid4 nofinalgrid
keywords: scfconv7
keywords: smallprint printgap noloewdin
keywords: NOSOSCF
formula: C15H17Cl2N3O2
InChI: InChI=1S/C15H17Cl2N3O2/c1-2-3-12-7-21-15(22-12,8-20-10-18-9-19-20)13-5-4-11(16)6-14(13)17/h4-6,9-10,12H,2-3,7-8H2,1H3
39 atoms
Cl -0.003277 -1.686986 -1.88286
Cl 4.783468 0.265826 -0.611205
O  -1.680175 -1.225021 0.546339
O  -1.422123 0.649018 1.715024
N  -1.421879 2.160087 -0.771188
N  -0.559846 2.440421 -1.753395
N  -0.864631 4.23431 -0.443852
C  -1.16218 0.059759 0.466999
C  -1.411851 -1.681315 1.860401
C  -1.515237 -0.383999 2.676372
C  -2.3895 -2.755862 2.288041
C  -1.941714 0.831705 -0.600738
C  0.339452 0.070113 0.185825
C  -2.194582 -4.124944 1.641339
C  0.927594 -0.671905 -0.836203
C  1.174687 0.891593 0.935542
C  -2.528174 -4.197686 0.1573
C  2.290479 -0.620616 -1.082281
C  2.537218 0.966102 0.70592
C  -1.586286 3.241068 0.006664
C  3.088376 0.199333 -0.304501
C  -0.254352 3.692163 -1.519282
H  -0.387069 -2.076626 1.912517
H  -2.475446 -0.301951 3.194788
H  -0.715735 -0.304453 3.418003
H  -3.409209 -2.394381 2.119916
H  -2.281035 -2.869056 3.371774
H  -2.990821 0.878654 -0.305151
H  -1.877169 0.325271 -1.560802
H  -2.82059 -4.839849 2.181157
H  -1.163373 -4.453082 1.80402
H  0.74693 1.502075 1.717728
H  -1.845338 -3.606867 -0.449332
H  -2.47541 -5.228331 -0.19444
H  -3.538875 -3.835705 -0.037661
H  2.720236 -1.209777 -1.879582
H  3.158409 1.617401 1.304001
H  -2.23156 3.25356 0.870816
H  0.429508 4.237209 -2.150566
totalener: -1817.01749537 hartree
nucrepener: 2209.05235069 hartree
electener: -4026.06984606 hartree
oneelecener: -6883.48441620 hartree
twoeener: 2857.41457014 hartree
kineticenergy: 1811.91923287 hartree
xcener: -128.814317220133 hartree
chargesum: -0.0000000
charge: -0.066873 -0.067595 -0.324661 -0.370309 0.110078 -0.304067 -0.328762 0.569454 0.120575 -0.013360 -0.151544 -0.104750 -0.177082 -0.106242 0.029398 -0.098490 -0.242063 -0.147755 -0.183834 0.039218 0.120545 0.061113 0.073881 0.078858 0.084303 0.068294 0.077811 0.111386 0.132582 0.070286 0.051730 0.138758 0.083260 0.084452 0.071394 0.112572 0.123807 0.143010 0.130621
qa: -0.0669 -0.0676 -0.3247 -0.3703 0.1101 -0.3041 -0.3288 0.5695 0.1206 -0.0134 -0.1515 -0.1047 -0.1771 -0.1062 0.0294 -0.0985 -0.2421 -0.1478 -0.1838 0.0392 0.1205 0.0611 0.0739 0.0789 0.0843 0.0683 0.0778 0.1114 0.1326 0.0703 0.0517 0.1388 0.0833 0.0845 0.0714 0.1126 0.1238 0.1430 0.1306
va: 1.2555 1.2378 2.0516 1.9871 3.3258 2.8558 3.0649 3.8286 3.8632 3.9920 3.9394 3.8492 3.6163 3.9172 3.9993 3.8770 3.9378 4.1003 4.1086 4.0829 3.9207 4.0465 1.0019 0.9995 0.9921 1.0176 1.0100 1.0223 1.0299 1.0055 1.0092 1.0236 1.0189 1.0055 1.0065 1.0264 1.0139 1.0132 1.0020
dispcorr: -0.023072791 hartree
energy: -1817.040568156114
dipole: -26.44593 25.76009 -0.68585 -15.80790 14.66128 -1.14663 17.70891 -16.40511 1.30380
magnitude: 1.86683 au
magnitude: 4.74510 debye
