program: Orca
programVersion: 4.2.1
elementType: Cl Cl O O N N N C C C C C C C C C C C C C C C H H H H H H H H H H H H H H H H H
charge: 0
multiplicity: 1
keywords: wb97x-d3
keywords: def2-TZVPP
keywords: def2/J RIJCOSX GRIDX6 NOFINALGRIDX
keywords: grid4 nofinalgrid
keywords: scfconv7
keywords: smallprint printgap noloewdin
keywords: NOSOSCF
formula: C15H17Cl2N3O2
InChI: InChI=1S/C15H17Cl2N3O2/c1-2-3-12-7-21-15(22-12,8-20-10-18-9-19-20)13-5-4-11(16)6-14(13)17/h4-6,9-10,12H,2-3,7-8H2,1H3
39 atoms
Cl 0.461679 -1.884248 -1.770151
Cl 4.927358 0.67139 -0.396858
O  -1.383679 -1.499029 0.472267
O  -1.399911 0.413717 1.629546
N  -1.407157 1.907404 -0.863739
N  -0.525502 2.278072 -1.797216
N  -1.107206 4.033305 -0.529616
C  -1.003566 -0.154719 0.416041
C  -1.715247 -1.851902 1.808181
C  -1.294048 -0.611762 2.594812
C  -3.199144 -2.164412 1.927978
C  -1.788638 0.531122 -0.70818
C  0.5005 -0.000597 0.210907
C  -3.707349 -3.221326 0.952153
C  1.219472 -0.721502 -0.739692
C  1.196425 0.952274 0.947449
C  -3.042355 -4.582512 1.110462
C  2.57854 -0.522918 -0.927337
C  2.551813 1.171202 0.777028
C  -1.738467 2.967659 -0.110568
C  3.237341 0.422565 -0.16238
C  -0.377027 3.557524 -1.560969
H  -1.117879 -2.722239 2.095792
H  -1.957341 -0.37688 3.42758
H  -0.269125 -0.698167 2.974164
H  -3.770212 -1.239562 1.793952
H  -3.389232 -2.495948 2.954832
H  -2.854452 0.465523 -0.481941
H  -1.608001 0.026573 -1.654555
H  -3.575767 -2.865393 -0.071806
H  -4.785341 -3.327662 1.098809
H  0.663995 1.551934 1.672252
H  -3.505564 -5.320303 0.455873
H  -1.982304 -4.552553 0.856427
H  -3.130114 -4.953123 2.133711
H  3.112045 -1.096785 -1.671329
H  3.063417 1.920629 1.363863
H  -2.432301 2.912832 0.713387
H  0.277734 4.172901 -2.157364
totalener: -1817.01715205 hartree
nucrepener: 2196.49971797 hartree
electener: -4013.51687002 hartree
oneelecener: -6858.41772496 hartree
twoeener: 2844.90085494 hartree
kineticenergy: 1811.91751941 hartree
xcener: -128.814030750280 hartree
chargesum: -0.0000000
charge: -0.061265 -0.068862 -0.353003 -0.355965 0.107575 -0.301274 -0.327542 0.586804 0.168324 -0.050135 -0.212067 -0.125882 -0.108148 -0.085751 -0.022518 -0.130115 -0.271322 -0.142093 -0.172098 0.037111 0.115778 0.061213 0.087702 0.095890 0.098424 0.080995 0.074400 0.113607 0.129136 0.065275 0.068690 0.137983 0.090091 0.084999 0.076386 0.109916 0.124260 0.142952 0.130529
qa: -0.0613 -0.0689 -0.3530 -0.3560 0.1076 -0.3013 -0.3275 0.5868 0.1683 -0.0501 -0.2121 -0.1259 -0.1081 -0.0858 -0.0225 -0.1301 -0.2713 -0.1421 -0.1721 0.0371 0.1158 0.0612 0.0877 0.0959 0.0984 0.0810 0.0744 0.1136 0.1291 0.0653 0.0687 0.1380 0.0901 0.0850 0.0764 0.1099 0.1243 0.1430 0.1305
va: 1.2616 1.2366 2.0254 1.9965 3.3267 2.8552 3.0635 3.8280 3.8284 4.0262 3.9570 3.8881 3.6066 3.8768 4.0592 3.8647 3.9386 4.0929 4.0951 4.0824 3.9241 4.0452 0.9929 1.0000 0.9948 1.0115 1.0120 1.0144 1.0311 1.0221 1.0079 1.0227 1.0069 1.0018 1.0010 1.0280 1.0135 1.0119 1.0022
dispcorr: -0.022665686 hartree
energy: -1817.039817732162
dipole: -32.76554 31.88527 -0.88027 -15.21613 14.11805 -1.09808 17.22455 -15.93692 1.28764
magnitude: 1.90753 au
magnitude: 4.84856 debye
