program: Orca
programVersion: 4.2.1
elementType: Cl Cl O O N N N C C C C C C C C C C C C C C C H H H H H H H H H H H H H H H H H
charge: 0
multiplicity: 1
keywords: wb97x-d3
keywords: def2-TZVPP
keywords: def2/J RIJCOSX GRIDX6 NOFINALGRIDX
keywords: grid4 nofinalgrid
keywords: scfconv7
keywords: smallprint printgap noloewdin
keywords: NOSOSCF
formula: C15H17Cl2N3O2
InChI: InChI=1S/C15H17Cl2N3O2/c1-2-3-12-7-21-15(22-12,8-20-10-18-9-19-20)13-5-4-11(16)6-14(13)17/h4-6,9-10,12H,2-3,7-8H2,1H3
39 atoms
Cl 1.110709 -0.425671 -2.441269
Cl 5.642111 -0.565093 0.351621
O  -1.019185 -0.533493 -0.434996
O  -0.809409 0.47908 1.536712
N  -2.009926 2.110586 -0.453155
N  -2.614911 2.805042 0.515029
N  -4.114733 2.090017 -0.991922
C  -0.316941 0.4644 0.237675
C  -1.567612 -1.451521 0.502287
C  -1.16392 -0.848184 1.854966
C  -3.06869 -1.559498 0.288701
C  -0.605418 1.82462 -0.407413
C  1.188167 0.19355 0.223761
C  -3.734396 -2.654954 1.118388
C  1.887877 -0.214087 -0.910832
C  1.924786 0.390927 1.388128
C  -3.314107 -4.07037 0.740915
C  3.254606 -0.449478 -0.876619
C  3.288493 0.164594 1.447145
C  -2.921554 1.684885 -1.340839
C  3.945491 -0.26504 0.307497
C  -3.871631 2.771549 0.149093
H  -1.090144 -2.425735 0.356585
H  -1.980399 -0.819438 2.577331
H  -0.322884 -1.388565 2.30465
H  -3.256976 -1.749412 -0.771873
H  -3.528298 -0.592618 0.513935
H  -0.201398 1.841326 -1.419355
H  -0.115678 2.612097 0.163256
H  -4.815215 -2.56099 0.99497
H  -3.54982 -2.489089 2.18467
H  1.413986 0.731696 2.278169
H  -2.258135 -4.25907 0.937611
H  -3.88075 -4.810506 1.305551
H  -3.488107 -4.262619 -0.318952
H  3.770954 -0.772344 -1.769333
H  3.831599 0.32126 2.368245
H  -2.669306 1.094708 -2.207565
H  -4.643701 3.260073 0.722631
totalener: -1817.01695927 hartree
nucrepener: 2164.67214348 hartree
electener: -3981.68910275 hartree
oneelecener: -6794.44945216 hartree
twoeener: 2812.76034941 hartree
kineticenergy: 1811.92176568 hartree
xcener: -128.815784637917 hartree
chargesum: -0.0000000
charge: -0.058179 -0.063802 -0.360672 -0.329424 0.126364 -0.294518 -0.332512 0.567387 0.150774 -0.022147 -0.169608 -0.134032 -0.114499 -0.107884 -0.044499 -0.145082 -0.255892 -0.148843 -0.161472 0.013577 0.107121 0.050900 0.083815 0.093238 0.088372 0.080136 0.087836 0.137110 0.124847 0.078818 0.049951 0.147000 0.070116 0.090205 0.082471 0.114269 0.126490 0.143320 0.128949
qa: -0.0582 -0.0638 -0.3607 -0.3294 0.1264 -0.2945 -0.3325 0.5674 0.1508 -0.0221 -0.1696 -0.1340 -0.1145 -0.1079 -0.0445 -0.1451 -0.2559 -0.1488 -0.1615 0.0136 0.1071 0.0509 0.0838 0.0932 0.0884 0.0801 0.0878 0.1371 0.1248 0.0788 0.0500 0.1470 0.0701 0.0902 0.0825 0.1143 0.1265 0.1433 0.1289
va: 1.2617 1.2417 2.0168 2.0418 3.3422 2.8789 3.0394 3.9025 3.8521 3.9493 3.9357 3.8020 3.6001 3.8990 4.0614 3.9399 3.9295 4.0745 4.0492 4.0923 3.9296 4.0505 1.0020 1.0066 0.9936 1.0167 1.0148 1.0135 1.0261 1.0074 1.0142 1.0229 1.0040 1.0063 1.0030 1.0278 1.0139 1.0107 1.0020
dispcorr: -0.022081226 hartree
energy: -1817.039040493436
dipole: -34.25884 34.87478 0.61594 -13.79723 12.83921 -0.95802 12.50012 -11.96922 0.53090
magnitude: 1.25660 au
magnitude: 3.19402 debye
