program: Orca
programVersion: 4.2.1
elementType: Cl Cl O O N N N C C C C C C C C C C C C C C C H H H H H H H H H H H H H H H H H
charge: 0
multiplicity: 1
keywords: wb97x-d3
keywords: def2-TZVPP
keywords: def2/J RIJCOSX GRIDX6 NOFINALGRIDX
keywords: grid4 nofinalgrid
keywords: scfconv7
keywords: smallprint printgap noloewdin
keywords: NOSOSCF
formula: C15H17Cl2N3O2
InChI: InChI=1S/C15H17Cl2N3O2/c1-2-3-12-7-21-15(22-12,8-20-10-18-9-19-20)13-5-4-11(16)6-14(13)17/h4-6,9-10,12H,2-3,7-8H2,1H3
39 atoms
Cl 1.147121 -0.401278 -2.425019
Cl 5.719334 -0.412346 0.306262
O  -0.954441 -0.618503 -0.402283
O  -0.754178 0.374336 1.588555
N  -2.004187 2.03116 -0.346978
N  -2.738642 1.814051 -1.441659
N  -4.038693 2.513749 0.246638
C  -0.275731 0.387442 0.277073
C  -1.63034 -1.465426 0.516321
C  -1.127769 -0.959371 1.868835
C  -3.136507 -1.350804 0.334626
C  -0.595015 1.761292 -0.325669
C  1.236187 0.160483 0.24854
C  -3.923449 -2.430752 1.074409
C  1.936574 -0.193951 -0.903915
C  1.978013 0.356459 1.409634
C  -3.782112 -3.824151 0.474154
C  3.31238 -0.373416 -0.889611
C  3.350566 0.184687 1.447915
C  -2.797763 2.443574 0.653751
C  4.01039 -0.187426 0.289999
C  -3.948386 2.115433 -1.041106
H  -1.301047 -2.493467 0.337556
H  -1.894945 -0.94835 2.643606
H  -0.272192 -1.540789 2.232164
H  -3.362856 -1.400472 -0.733461
H  -3.464969 -0.36285 0.670485
H  -0.229983 1.819444 -1.348784
H  -0.085086 2.529708 0.257962
H  -4.978308 -2.148777 1.069226
H  -3.636832 -2.454499 2.131334
H  1.466584 0.651521 2.315292
H  -2.75518 -4.190489 0.503679
H  -4.395598 -4.547366 1.011382
H  -4.100729 -3.833456 -0.569126
H  3.830236 -0.653238 -1.795873
H  3.898034 0.340091 2.366642
H  -2.430516 2.682695 1.639185
H  -4.797719 2.055793 -1.703278
totalener: -1817.01679660 hartree
nucrepener: 2166.70691106 hartree
electener: -3983.72370767 hartree
oneelecener: -6798.65723956 hartree
twoeener: 2814.93353189 hartree
kineticenergy: 1811.91494284 hartree
xcener: -128.814662535943 hartree
chargesum: -0.0000000
charge: -0.043008 -0.064950 -0.336501 -0.365675 0.111813 -0.284839 -0.331843 0.570458 0.167878 -0.037879 -0.178205 -0.136946 -0.097200 -0.112588 -0.052957 -0.149932 -0.249176 -0.145850 -0.162777 0.026729 0.107606 0.049758 0.083195 0.096185 0.094646 0.086742 0.081324 0.134415 0.127584 0.078717 0.046896 0.140966 0.068449 0.088099 0.080892 0.113713 0.125236 0.140467 0.128556
qa: -0.0430 -0.0649 -0.3365 -0.3657 0.1118 -0.2848 -0.3318 0.5705 0.1679 -0.0379 -0.1782 -0.1369 -0.0972 -0.1126 -0.0530 -0.1499 -0.2492 -0.1459 -0.1628 0.0267 0.1076 0.0498 0.0832 0.0962 0.0946 0.0867 0.0813 0.1344 0.1276 0.0787 0.0469 0.1410 0.0684 0.0881 0.0809 0.1137 0.1252 0.1405 0.1286
va: 1.2786 1.2405 2.0491 1.9962 3.3579 2.8625 3.0399 3.8770 3.8792 3.9569 3.9325 3.8197 3.5942 3.9052 4.0983 3.9338 3.9322 4.0668 4.0563 4.0736 3.9264 4.0403 0.9996 1.0058 0.9976 1.0209 1.0192 1.0317 1.0046 1.0066 1.0134 1.0253 1.0054 1.0057 1.0042 1.0288 1.0143 1.0116 1.0039
dispcorr: -0.022257701 hartree
energy: -1817.039054304890
dipole: -36.02208 36.57981 0.55773 -12.52004 11.89872 -0.62131 13.25120 -12.19050 1.06070
magnitude: 1.34989 au
magnitude: 3.43114 debye
