program: Orca
programVersion: 4.2.1
elementType: Cl Cl O O N N N C C C C C C C C C C C C C C C H H H H H H H H H H H H H H H H H
charge: 0
multiplicity: 1
keywords: wb97x-d3
keywords: def2-TZVPP
keywords: def2/J RIJCOSX GRIDX6 NOFINALGRIDX
keywords: grid4 nofinalgrid
keywords: scfconv7
keywords: smallprint printgap noloewdin
keywords: NOSOSCF
formula: C15H17Cl2N3O2
InChI: InChI=1S/C15H17Cl2N3O2/c1-2-3-12-7-21-15(22-12,8-20-10-18-9-19-20)13-5-4-11(16)6-14(13)17/h4-6,9-10,12H,2-3,7-8H2,1H3
39 atoms
Cl 0.87219 -0.729324 -2.228148
Cl 5.698346 -0.54598 0.01806
O  -1.008062 -0.655331 0.017107
O  -0.596547 0.590473 1.824726
N  -2.029111 1.935347 -0.313881
N  -2.672844 2.588158 0.657878
N  -4.124471 1.842183 -0.882455
C  -0.253858 0.419876 0.48881
C  -1.556065 -1.380521 1.113148
C  -0.929035 -0.685744 2.323365
C  -3.074087 -1.316876 1.099334
C  -0.615112 1.704232 -0.269997
C  1.243638 0.150107 0.336265
C  -3.725765 -1.890045 -0.154772
C  1.817614 -0.361026 -0.826609
C  2.10339 0.462734 1.384734
C  -3.527611 -3.391031 -0.322693
C  3.183556 -0.577765 -0.929782
C  3.469381 0.255146 1.306893
C  -2.911571 1.490718 -1.220747
C  4.001244 -0.27273 0.143807
C  -3.923497 2.509833 0.274808
H  -1.217559 -2.418982 1.043786
H  -1.619709 -0.56196 3.157694
H  -0.039441 -1.219072 2.680283
H  -3.388314 -0.278605 1.241818
H  -3.436266 -1.868996 1.974349
H  -0.241809 1.644932 -1.291989
H  -0.135522 2.555353 0.212352
H  -3.349941 -1.367326 -1.036093
H  -4.794351 -1.667144 -0.114734
H  1.690526 0.882019 2.291816
H  -3.888531 -3.940511 0.549148
H  -4.07306 -3.762269 -1.190254
H  -2.479488 -3.655656 -0.469669
H  3.601364 -0.979183 -1.84191
H  4.110279 0.503301 2.140877
H  -2.621986 0.930183 -2.095883
H  -4.721408 2.958639 0.845518
totalener: -1817.01760776 hartree
nucrepener: 2189.03048561 hartree
electener: -4006.04809337 hartree
oneelecener: -6843.26417051 hartree
twoeener: 2837.21607714 hartree
kineticenergy: 1811.91663103 hartree
xcener: -128.815250529538 hartree
chargesum: -0.0000000
charge: -0.059520 -0.063935 -0.357369 -0.325553 0.134191 -0.302649 -0.323941 0.589398 0.138962 -0.035455 -0.185739 -0.152545 -0.099781 -0.099806 -0.062501 -0.138699 -0.263590 -0.146717 -0.159361 0.005790 0.106149 0.048448 0.081135 0.094212 0.092442 0.094661 0.077766 0.136980 0.125406 0.071139 0.078782 0.145634 0.074552 0.089686 0.077572 0.114174 0.126200 0.145006 0.128878
qa: -0.0595 -0.0639 -0.3574 -0.3256 0.1342 -0.3026 -0.3239 0.5894 0.1390 -0.0355 -0.1857 -0.1525 -0.0998 -0.0998 -0.0625 -0.1387 -0.2636 -0.1467 -0.1594 0.0058 0.1061 0.0484 0.0811 0.0942 0.0924 0.0947 0.0778 0.1370 0.1254 0.0711 0.0788 0.1456 0.0746 0.0897 0.0776 0.1142 0.1262 0.1450 0.1289
va: 1.2612 1.2416 2.0164 2.0491 3.3220 2.8626 3.0305 3.8490 3.8712 3.9938 3.9156 3.8156 3.6102 3.8691 4.0733 3.9279 3.9340 4.0703 4.0500 4.0857 3.9293 4.0423 0.9957 1.0010 0.9916 1.0155 1.0158 1.0124 1.0258 1.0164 1.0114 1.0231 1.0026 1.0065 0.9998 1.0274 1.0142 1.0051 1.0038
dispcorr: -0.023207119 hartree
energy: -1817.040814879566
dipole: -33.86724 34.56720 0.69997 -9.58455 8.90308 -0.68146 10.24710 -9.67146 0.57564
magnitude: 1.13389 au
magnitude: 2.88212 debye
