program: Orca
programVersion: 4.2.1
elementType: Cl Cl O O N N N C C C C C C C C C C C C C C C H H H H H H H H H H H H H H H H H
charge: 0
multiplicity: 1
keywords: wb97x-d3
keywords: def2-TZVPP
keywords: def2/J RIJCOSX GRIDX6 NOFINALGRIDX
keywords: grid4 nofinalgrid
keywords: scfconv7
keywords: smallprint printgap noloewdin
keywords: NOSOSCF
formula: C15H17Cl2N3O2
InChI: InChI=1S/C15H17Cl2N3O2/c1-2-3-12-7-21-15(22-12,8-20-10-18-9-19-20)13-5-4-11(16)6-14(13)17/h4-6,9-10,12H,2-3,7-8H2,1H3
39 atoms
Cl 1.053814 -0.889053 -2.209197
Cl 5.818611 -0.197437 0.068902
O  -0.851298 -0.809654 0.019723
O  -0.566651 0.608494 1.723361
N  -2.077796 1.729361 -0.403263
N  -2.872943 1.251638 -1.36501
N  -4.092615 2.222721 0.24713
C  -0.194544 0.355512 0.40196
C  -1.394804 -1.465569 1.15636
C  -0.833764 -0.644913 2.318137
C  -2.912358 -1.488027 1.10278
C  -0.654922 1.545713 -0.448772
C  1.321521 0.197122 0.284597
C  -3.475693 -2.130737 -0.157509
C  1.948055 -0.354137 -0.83263
C  2.139483 0.647515 1.316198
C  -4.996872 -2.159056 -0.147164
C  3.328087 -0.477754 -0.902511
C  3.517938 0.534979 1.269176
C  -2.823681 2.302585 0.554063
C  4.104519 -0.037172 0.154249
C  -4.068723 1.569812 -0.935117
H  -1.011903 -2.491612 1.176384
H  -1.548298 -0.498646 3.128635
H  0.079695 -1.089332 2.730535
H  -3.303283 -0.470198 1.205975
H  -3.264888 -2.038961 1.98243
H  -0.372342 1.39972 -1.488865
H  -0.158807 2.448802 -0.089365
H  -3.088448 -3.150056 -0.25484
H  -3.124572 -1.579714 -1.031043
H  1.684719 1.098621 2.187147
H  -5.392876 -2.605107 -1.059432
H  -5.382654 -2.735639 0.695549
H  -5.406772 -1.150723 -0.067881
H  3.788312 -0.913646 -1.777751
H  4.125984 0.888349 2.089753
H  -2.404203 2.759956 1.436064
H  -4.957202 1.330385 -1.497934
totalener: -1817.01921655 hartree
nucrepener: 2185.51687424 hartree
electener: -4002.53609079 hartree
oneelecener: -6836.33504997 hartree
twoeener: 2833.79895918 hartree
kineticenergy: 1811.91774748 hartree
xcener: -128.814923272307 hartree
chargesum: 0.0000000
charge: -0.043902 -0.064592 -0.340004 -0.363427 0.128944 -0.300047 -0.327921 0.581863 0.192540 -0.045687 -0.223427 -0.141255 -0.102073 -0.087329 -0.053070 -0.145154 -0.263267 -0.148897 -0.163522 0.026794 0.108912 0.041089 0.077791 0.097274 0.095493 0.080665 0.075891 0.137376 0.127849 0.061237 0.086626 0.141301 0.086156 0.072500 0.079030 0.113446 0.125765 0.140560 0.134471
qa: -0.0439 -0.0646 -0.3400 -0.3634 0.1289 -0.3000 -0.3279 0.5819 0.1925 -0.0457 -0.2234 -0.1413 -0.1021 -0.0873 -0.0531 -0.1452 -0.2633 -0.1489 -0.1635 0.0268 0.1089 0.0411 0.0778 0.0973 0.0955 0.0807 0.0759 0.1374 0.1278 0.0612 0.0866 0.1413 0.0862 0.0725 0.0790 0.1134 0.1258 0.1406 0.1345
va: 1.2780 1.2408 2.0338 1.9961 3.3386 2.8422 3.0292 3.8528 3.8545 3.9899 3.9404 3.8170 3.5973 3.8404 4.1014 3.9256 3.9443 4.0686 4.0571 4.0751 3.9262 4.0236 0.9973 1.0016 0.9957 1.0083 1.0193 1.0318 1.0049 1.0097 1.0297 1.0246 1.0058 1.0030 1.0014 1.0288 1.0145 1.0121 1.0018
dispcorr: -0.023350458 hartree
energy: -1817.042567007727
dipole: -37.36178 38.14796 0.78618 -6.88720 6.61891 -0.26829 11.60633 -10.55859 1.04774
magnitude: 1.33710 au
magnitude: 3.39863 debye
