program: Orca
programVersion: 4.2.1
elementType: Cl Cl O O N N N C C C C C C C C C C C C C C C H H H H H H H H H H H H H H H H H
charge: 0
multiplicity: 1
keywords: wb97x-d3
keywords: def2-TZVPP
keywords: def2/J RIJCOSX GRIDX6 NOFINALGRIDX
keywords: grid4 nofinalgrid
keywords: scfconv7
keywords: smallprint printgap noloewdin
keywords: NOSOSCF
formula: C15H17Cl2N3O2
InChI: InChI=1S/C15H17Cl2N3O2/c1-2-3-12-7-21-15(22-12,8-20-10-18-9-19-20)13-5-4-11(16)6-14(13)17/h4-6,9-10,12H,2-3,7-8H2,1H3
39 atoms
Cl 0.50007 -1.33127 -2.329236
Cl 4.853579 0.459532 0.16246
O  -1.637377 -1.296311 -0.282229
O  -1.695464 0.305795 1.25236
N  -1.268336 2.280461 -0.851865
N  -0.250205 2.748127 -1.580779
N  -0.849919 4.244937 -0.023398
C  -1.170095 -0.019702 -0.007082
C  -1.605025 -2.008066 0.940351
C  -1.848432 -0.898473 1.979482
C  -2.643747 -3.109166 0.925322
C  -1.758192 0.943235 -1.041113
C  0.355286 0.054657 0.022724
C  -2.597638 -3.968767 2.183361
C  1.164119 -0.492433 -0.971092
C  0.988637 0.750169 1.047418
C  -3.622519 -5.093102 2.154627
C  2.544777 -0.376144 -0.9310
C  2.364267 0.885843 1.10703
C  -1.608624 3.184851 0.079383
C  3.136115 0.312675 0.112794
C  -0.035115 3.926548 -1.052017
H  -0.607955 -2.447111 1.086466
H  -2.861145 -0.930947 2.391627
H  -1.137984 -0.951598 2.809051
H  -2.477136 -3.739243 0.047536
H  -3.637876 -2.665502 0.809545
H  -2.845934 0.929204 -0.95804
H  -1.48543 0.630717 -2.046488
H  -2.768274 -3.349098 3.0695
H  -1.595222 -4.391168 2.299972
H  0.388598 1.212562 1.81816
H  -4.637591 -4.702111 2.07219
H  -3.456416 -5.756301 1.304677
H  -3.575108 -5.698369 3.059383
H  3.148539 -0.812698 -1.713544
H  2.826189 1.435883 1.9144
H  -2.401803 3.027403 0.7930
H  0.734557 4.583975 -1.424149
totalener: -1817.01872449 hartree
nucrepener: 2176.70682873 hartree
electener: -3993.72555321 hartree
oneelecener: -6818.72156725 hartree
twoeener: 2824.99601403 hartree
kineticenergy: 1811.92286855 hartree
xcener: -128.814463204005 hartree
chargesum: -0.0000000
charge: -0.059452 -0.068317 -0.331767 -0.367648 0.107243 -0.302378 -0.327915 0.571660 0.145628 -0.029984 -0.154827 -0.098650 -0.169385 -0.088925 0.009354 -0.112676 -0.263322 -0.141903 -0.185464 0.036494 0.121168 0.060316 0.077088 0.082656 0.088727 0.080155 0.063563 0.111805 0.130857 0.057996 0.064484 0.140162 0.076170 0.078730 0.088065 0.110592 0.124510 0.144335 0.130857
qa: -0.0595 -0.0683 -0.3318 -0.3676 0.1072 -0.3024 -0.3279 0.5717 0.1456 -0.0300 -0.1548 -0.0987 -0.1694 -0.0889 0.0094 -0.1127 -0.2633 -0.1419 -0.1855 0.0365 0.1212 0.0603 0.0771 0.0827 0.0887 0.0802 0.0636 0.1118 0.1309 0.0580 0.0645 0.1402 0.0762 0.0787 0.0881 0.1106 0.1245 0.1443 0.1309
va: 1.2641 1.2369 2.0544 1.9903 3.3268 2.8549 3.0646 3.8541 3.8610 3.9679 3.9463 3.8424 3.6286 3.8582 4.0266 3.8905 3.9551 4.0910 4.1098 4.0825 3.9166 4.0456 1.0058 0.9978 0.9894 1.0178 1.0169 1.0228 1.0300 1.0089 1.0092 1.0223 1.0025 1.0032 1.0051 1.0283 1.0137 1.0130 1.0021
dispcorr: -0.021993841 hartree
energy: -1817.040718327410
dipole: -32.02987 31.12079 -0.90909 -20.50498 19.06481 -1.44017 19.15338 -18.18913 0.96425
magnitude: 1.95712 au
magnitude: 4.97460 debye
