program: Orca
programVersion: 4.2.1
elementType: Cl Cl O O N N N C C C C C C C C C C C C C C C H H H H H H H H H H H H H H H H H
charge: 0
multiplicity: 1
keywords: wb97x-d3
keywords: def2-TZVPP
keywords: def2/J RIJCOSX GRIDX6 NOFINALGRIDX
keywords: grid4 nofinalgrid
keywords: scfconv7
keywords: smallprint printgap noloewdin
keywords: NOSOSCF
formula: C15H17Cl2N3O2
InChI: InChI=1S/C15H17Cl2N3O2/c1-2-3-12-7-21-15(22-12,8-20-10-18-9-19-20)13-5-4-11(16)6-14(13)17/h4-6,9-10,12H,2-3,7-8H2,1H3
39 atoms
Cl 1.09245 -0.054109 -2.446778
Cl 5.589765 -0.832532 0.297622
O  -1.062651 -0.40418 -0.458505
O  -0.781212 0.367825 1.634038
N  -1.942282 2.217538 -0.250773
N  -2.601819 2.74019 0.788121
N  -4.025066 2.238965 -0.872443
C  -0.31264 0.47377 0.319874
C  -1.707541 -1.335722 0.396369
C  -1.877121 -0.520234 1.669111
C  -3.00042 -1.804854 -0.23816
C  -0.542123 1.909853 -0.184052
C  1.173944 0.135367 0.284415
C  -3.805487 -2.743859 0.658344
C  1.867252 -0.11283 -0.899523
C  1.901936 0.08792 1.469328
C  -3.091862 -4.042431 1.013431
C  3.221161 -0.413042 -0.901961
C  3.254446 -0.204514 1.492085
C  -2.809213 1.915538 -1.229089
C  3.906466 -0.458717 0.29879
C  -3.843476 2.737586 0.369881
H  -1.03715 -2.187095 0.577353
H  -2.824207 0.032431 1.675416
H  -1.820519 -1.123237 2.576808
H  -2.77328 -2.307801 -1.18225
H  -3.606641 -0.928406 -0.485478
H  -0.104132 2.044192 -1.172349
H  -0.064997 2.613268 0.496266
H  -4.740821 -2.978728 0.146122
H  -4.099689 -2.223429 1.574972
H  1.395686 0.281531 2.40369
H  -2.764232 -4.571744 0.11723
H  -2.211398 -3.877041 1.635979
H  -3.751436 -4.711136 1.566052
H  3.731301 -0.608857 -1.834207
H  3.791547 -0.236501 2.429338
H  -2.508464 1.472183 -2.165337
H  -4.648413 3.118793 0.978603
totalener: -1817.01841888 hartree
nucrepener: 2167.88134325 hartree
electener: -3984.89976213 hartree
oneelecener: -6800.87592025 hartree
twoeener: 2815.97615813 hartree
kineticenergy: 1811.91613161 hartree
xcener: -128.816181969438 hartree
chargesum: 0.0000000
charge: -0.062813 -0.065504 -0.363991 -0.358745 0.130097 -0.313100 -0.333588 0.554606 0.164522 -0.015622 -0.177751 -0.136220 -0.088275 -0.114858 -0.024130 -0.132265 -0.256467 -0.153667 -0.153345 0.014347 0.106041 0.051855 0.085513 0.081458 0.089830 0.082597 0.090054 0.135849 0.120855 0.077864 0.061093 0.139177 0.083938 0.070847 0.091860 0.114253 0.125131 0.146734 0.131820
qa: -0.0628 -0.0655 -0.3640 -0.3587 0.1301 -0.3131 -0.3336 0.5546 0.1645 -0.0156 -0.1778 -0.1362 -0.0883 -0.1149 -0.0241 -0.1323 -0.2565 -0.1537 -0.1533 0.0143 0.1060 0.0519 0.0855 0.0815 0.0898 0.0826 0.0901 0.1358 0.1209 0.0779 0.0611 0.1392 0.0839 0.0708 0.0919 0.1143 0.1251 0.1467 0.1318
va: 1.2575 1.2398 2.0126 2.0187 3.3260 2.8549 3.0229 3.8754 3.8261 4.0078 3.9521 3.8165 3.6205 3.8885 4.0220 3.9680 3.9321 4.0834 4.0404 4.0764 3.9260 4.0356 1.0019 0.9952 0.9985 1.0120 1.0188 1.0167 1.0274 1.0090 1.0079 1.0303 1.0024 1.0018 1.0070 1.0275 1.0141 1.0094 1.0019
dispcorr: -0.022293569 hartree
energy: -1817.040712444803
dipole: -34.99982 35.33056 0.33074 -13.95772 13.05437 -0.90335 11.59848 -11.21608 0.38240
magnitude: 1.03521 au
magnitude: 2.63130 debye
